Difference: IUedaAtlasSimulationSoftwareValidationOld (1 vs. 2)

Revision 22010-06-11 - PeterJones

Line: 1 to 1
 
META TOPICPARENT name="IUedaAtlasSimulationSoftwareValidation"

Revision 12007-06-07 - IUedaZP

Line: 1 to 1
Added:
>
>
META TOPICPARENT name="IUedaAtlasSimulationSoftwareValidation"


Software Validation

Status Report

Status 6/1

  • General status
    • ATN builds: mostly ok
    • ATN tests: some errors (see below)
      • AtlasSimulation success = 4-5/6 (13.0.X i686-slc4-gcc34-opt)
    • RTT tests: some errors (see below)
      • G4AtlasApps success = 8/16 (13.0.X i686-slc4-gcc34-opt)
      • SimuJobTransforms success = 0-1/3 (13.0.X i686-slc4-gcc34-opt)

  • new issues
    • ATN: Herwig_i fails for 13.X.0 Dev64B since May 31 (rel_4).
    • RTT: new jobs
      • G4AtlasApps: Test with commisioning layouts: error "Segmentation fault (invalid memory reference)"
      • SimuJobTransforms: timedOut ==> solution found

  • other issues
    • ATN builds
      • G4FastSimulation occasionally fails
      • 10 Generator packages fail for 13.0.X 64bit (both bugfix and val)
      • many failure in 13.0.X-LCG as well as other projects
    • ATN tests
      • AtlasSimulationRelease#PROJECT_UNIT_TEST' keeps failing.
      • some tests killed as time quota spent.
      • G4AtlasApps_AtlasSim, CaloSimEx_TestConfiguration, CaloDigEx_TestConfiguration: occasional failures with "*** Break * segmentation violation" (coral::ConnectionService)
    • RTT tests
      • reading single particle events: mostly error, occasionally success "Segmentation fault (invalid memory reference)"
      • generating single-pi events: killed after >30000 NCU seconds


ATN status 5/25
  • BF32B
    • builds mostly ok
      • 2007/05/19,20 (rel_6,0) some failed due to disk space problem.
      • 2007/05/22 rel_2 BF32BS3 nightlies stuck. #AtnNote20070522
      • *FastSimulation failed for BF32BS3 5/21 (rel_1), 5/23 (rel_3)

    • tests
      • BF32BS3 many tests failed: (success=0-2/6)
      • G4AtlasApps_AtlasSim failed occasionally also for BF32BS4 and BF64BS4
      • 'AtlasSimulationRelease#PROJECT_UNIT_TEST' keeps failing.

  • BF64B
    • builds fail for 10 Generators
    • tests fail less (success=3-4/6) comparing to before (success=0-2/6).

  • VAL, DEV
    • builds ok now
    • many tests fail

  • LCG
    • many builds failed (92) since 5/23 (rel_3)
    • all tests keep failing

  • COS
    • builds
      • 5/24 (rel_4) 3 fails: 'PixelDigitization', 'SCT_Digitization', 'TRT_Digitization'
      • 5/19,22 (rel_6,2) 13 fails


Status 5/18
  • BF32B
    • builds ok
      • 2007/05/15 rel_2 No build available in 13.0.X, i686-slc3-gcc323-opt
      • 2007/05/14 rel_1 'Pythia_i' failed in 13.0.X, i686-slc3-gcc323-opt
      • 2007/05/12 rel_6 'G4AtlasControl' failed in 13.0.X, i686-slc4-gcc34-opt
    • test fails for 'AtlasSimulationRelease#PROJECT_UNIT_TEST' (always).
    • BF32BS4SimOpt tests failed: 2/6 (5/18)
    • BF32BS3SimDbg tests failed: 2/6
    • BF32BS3SimOpt tests ok except for 'AtlasSimulationRelease#PROJECT_UNIT_TEST'

  • BF64B
    • builds fail for 10-11 Generators

  • VAL, DEV
    • builds ok now
      • failed with 'MuonHitTest' (5/15 - 5/16)

  • LCG
    • builds ok, all tests fail

  • COS
    • builds fail for 'PixelDigitization', 'SCT_Digitization', 'TRT_Digitization'

  • Comment:
    • fixed the mails sent by NICOS gives a path such as
      /afs/cern.ch/atlas/software/builds/nightlies/bugfix/AtlasSimulation/rel_0/NICOS_TestLogBF32BS3SimOpt/Simulation_G4Atlas_G4AtlasApps_G4AtlasApps_AtlasSim.loglog
      but it is wrong. There must be 'NICOS_area' after 'rel_*'.
      /afs/cern.ch/atlas/software/builds/nightlies/bugfix/AtlasSimulation/rel_0/NICOS_area/NICOS_TestLogBF32BS3SimOpt/Simulation_G4Atlas_G4AtlasApps_G4AtlasApps_AtlasSim.loglog


RTT status 5/25

  • Many RTT jobs failed this week for disk space problem, build corruption, build stuck for the change of java. 5/19,20 (rel_6,0), 5/22 (rel_2)
  • bugfix i686-slc4-gcc34-opt: success = 5-8/15
  • bugfix i686-slc3-gcc323-opt: all jobs failed: success = 0/15
  • val i686-slc4-gcc34-dbg: success = 7-13/15

G4AtlasApps

  • Gen on the fly. single particles:
    • occasional failure with status='timedOut'.
  • Read from file. single particles:
    • the same problem as before
    • pi pt50GeV eta3.2: keeps failing in the middle of the run, after 200 events. (should use long queue?)

SimuJobTransforms

  • T1_McAtNlo_Jimmy
    • mostly job:success test:error, excetp for val i686-slc4-gcc34-dbg 5/24 (rel_4) both:success.

Outstanding problems

  • all jobs failed for bugfix i686-slc3-gcc323-opt
             raise RuntimeError('SimSkeleton: found problems with the '+\
         RuntimeError: SimSkeleton: found problems with the method  _do_persitency
         athena> 
         ApplicationMgr      FATAL finalize: Invalid state "Configured"
         


Status Summary 5/18

RTT Status

  • RTT as a whole failed on 5/17,18 (rel_4,5)
  • RTT for bugfix i686-slc4-gcc34-opt on 07/05/20 (rel_0) is possibly affected by disk space problems.
  • RTT for bugfix i686-slc3-gcc323-opt faild on 07/05/20 (rel_0), 07/05/19 (rel_6)
  • RTT for val i686-slc4-gcc34-dbg failed on 07/05/19 (rel_6)

G4AtlasApps

  • Recursive geometry test (1 job): ok (occasional errors due to build problems)

  • Gen on the fly. single particles (6 jobs):
    • e pt50GeV eta2.5: failed once (Segmentation fault in the very early stage of run)
    • 4 jobs timedOut for bugfix i686-slc4-gcc34-opt on 07/05/20 (rel_0); both of e and both of pi jobs (both of mu jobs succeeded), or, possibly affected by disk space problems?
    • pi pt50GeV eta3.2: keeps failing in the middle of the run, after 200 events. (should use long queue?)

  • Read from file. T1_McAtNlo_Jimmy (1 job)
    • failed once: stderr not accessible (07/05/14 rel_1 val i686-slc4-gcc34-dbg)

  • Read from file. Single particles (6 jobs)
    • mostly fail (Segmentation fault in the beginning of run)

  • G4AtlasTests: ok

SimuJobTransforms

  • T1_McAtNlo_Jimmy
    • job:success test:error
    • ERROR; TRF_UNKNOWN (69999); PoolSvc; Failed to set POOL property, TREE_MAX_SIZE to 1099511627776L

ATN


  • Date: Sun, 22 Apr 2007 17:17:35 +0200
    Both the 13.0.X and 13.X.0 nightlies have been upgraded to the following external project versions:

    GAUDI v19r2p3
    LCGCMT LCGCMT_51
    tdaq-common tdaq-common-01-06-01
    dqm-common dqm-common-00-02-01

    This has been extensively tested in the 13.0.X-MIG0 nightlies.

    David

    https://hypernews.cern.ch/HyperNews/Atlas/get/SWDevelopersAnnounce/169.html

Nightly Platform opt/dbg mail Tests Periodicity
13.0.X (bugfix) slc3/slc4 (32/64) opt/dbg Yes Yes* nightly
13.0.X-VAL slc4 (32) opt/dbg Yes Yes nightly
13.X.0 (dev) slc4 (32/64) opt/dbg Yes Yes nightly
13.0.X-LCG slc4(32) dbg No? Yes nightly
2.0.X cache slc3(32) opt No No nightly
    • * except in slc4_gcc34_dbg "master platform"
    • I don't write the MIG nightlies you should not care about

ATN issues

G4AtlasApps_AtlasSim
Thu, 31 May 2007 rel_4 13.0.X i686-slc4-gcc34-opt File ".../PyCintex.py", line 59, in loadDictionary
Thu, 31 May 2007 rel_4 13.X.0 i686-slc4-gcc34-opt File ".../PyCintex.py", line 59, in loadDictionary
Thu, 31 May 2007 rel_4 13.0.X-VAL i686-slc4-gcc34-dbg File ".../PyCintex.py", line 59, in loadDictionary
Wed, 30 May 2007 rel_3 13.X.0 i686-slc4-gcc34-opt test killed as time quota spent
Wed, 30 May 2007 rel_3 13.0.X-VAL i686-slc4-gcc34-dbg test killed as time quota spent
Tue, 29 May 2007 rel_2 13.X.0 i686-slc4-gcc34-opt StorageSvc Error Cannot connect to proper technology domain.
Tue, 29 May 2007 rel_2 13.0.X i686-slc4-gcc34-opt File ".../gaudimodule.py", line 187, in initialize
Tue, 29 May 2007 rel_2 13.0.X-VAL i686-slc4-gcc34-dbg File ".../gaudimodule.py", line 187, in initialize
Tue, 29 May 2007 rel_2 13.0.X i686-slc3-gcc323-opt test killed as time quota spent
Mon, 28 May 2007 rel_1 13.X.0 i686-slc4-gcc34-opt StorageSvc Error Cannot connect to proper technology domain.
Mon, 28 May 2007 rel_1 13.0.X i686-slc3-gcc323-opt test killed as time quota spent
Mon, 28 May 2007 rel_1 13.0.X-VAL i686-slc4-gcc34-dbg test killed as time quota spent
Sun, 27 May 2007 rel_0 13.X.0 i686-slc4-gcc34-opt test killed as time quota spent
Sun, 27 May 2007 rel_0 13.0.X-VAL i686-slc4-gcc34-dbg File ".../gaudimodule.py", line 187, in initialize
Sat, 26 May 2007 rel_6 13.X.0 i686-slc4-gcc34-opt test killed as time quota spent
Sat, 26 May 2007 rel_6 13.0.X i686-slc4-gcc34-opt File ".../gaudimodule.py", line 187, in initialize
Sat, 26 May 2007 rel_6 13.0.X-VAL i686-slc4-gcc34-dbg test killed as time quota spent
Fri, 25 May 2007 rel_5 13.0.X i686-slc3-gcc323-opt RuntimeError: SimSkeleton
Fri, 25 May 2007 rel_5 13.X.0 i686-slc4-gcc34-opt test killed as time quota spent
Fri, 25 May 2007 rel_5 13.0.X-VAL i686-slc4-gcc34-dbg test killed as time quota spent
Thu, 24 May 2007 rel_4 13.X.0 i686-slc4-gcc34-opt test killed as time quota spent
Thu, 24 May 2007 rel_4 13.0.X i686-slc4-gcc34-opt File "../gaudimodule.py", line 187, in initialize
Thu, 24 May 2007 rel_4 13.0.X i686-slc3-gcc323-opt RuntimeError: SimSkeleton
Thu, 24 May 2007 rel_4 13.0.X-VAL i686-slc4-gcc34-dbg test killed as time quota spent
Wed, 23 May 2007 rel_3 13.0.X i686-slc3-gcc323-opt RuntimeError: SimSkeleton
Wed, 23 May 2007 rel_3 13.0.X-VAL i686-slc4-gcc34-dbg File "../gaudimodule.py", line 187, in initialize
Tue, 22 May 2007 rel_2 13.0.X i686-slc4-gcc34-opt
Tue, 22 May 2007 rel_2 13.0.X-VAL i686-slc4-gcc34-dbg
Mon, 21 May 2007 rel_1 13.0.X-VAL i686-slc4-gcc34-dbg
Mon, 21 May 2007 rel_1 13.X.0 i686-slc4-gcc34-opt
Mon, 21 May 2007 rel_1 13.0.X-VAL i686-slc4-gcc34-dbg
2007/05/20 rel_0 BF32BS4SimOpt
2007/05/20 rel_0 BF32BS3SimOpt
2007/05/18 rel_5 i686-slc4-gcc34-dbg
  • no more failure on 05/17, rel_4.
  • started failing on 05/12, rel_6.

  • 13.0.X rel_4 i686-slc4-gcc34-opt Thu, 31 May 2007 10:48:59 +0200 suspicious pattern:"FAILURE (ERROR)" !!! /afs/cern.ch/atlas/software/builds/nightlies/bugfix/AtlasSimulation/rel_4/NICOS_area/NICOS_TestLogBF32BS4SimOpt/Simulation_G4Atlas_G4AtlasApps_G4AtlasApps_AtlasSim.loglog and(or) http://cern.ch/atlas-computing/links/distDirectory/nightlies/BFWebArea/nicos_web_areaBF32BS4SimOpt/NICOS_TestLog_rel_4/Simulation_G4Atlas_G4AtlasApps_G4AtlasApps_AtlasSim.loglog
            File "/afs/cern.ch/sw/lcg/external/root/5.14.00e/slc4_ia32_gcc34/root/lib/PyCintex.py", line 59, in loadDictionary
              if sc == -1 : raise "Error Loading dictionary" 
          Error Loading dictionary
          athena> 
          ApplicationMgr      FATAL finalize: Invalid state "Configured"
          ApplicationMgr       INFO Application Manager Terminated successfully
          Py:Athena            INFO leaving with code 97: "failure in finalization"
           -------------------------------- 
           FAILURE (ERROR) : test jobOptions.G4Atlas_Sim.py
           -------------------------------- 
          [ATN, test wrapper] minutes elapsed: 1 
          [ATN, test wrapper] completion of test process is detected
          

  • 13.X.0 rel_4 i686-slc4-gcc34-opt Thu, 31 May 2007 10:39:59 +0200 suspicious pattern:"FAILURE (ERROR)" !!! /afs/cern.ch/atlas/software/builds/nightlies/dev/AtlasSimulation/rel_4/NICOS_area/NICOS_TestLogDev32BS4SimOpt/Simulation_G4Atlas_G4AtlasApps_G4AtlasApps_AtlasSim.loglog and(or) http://cern.ch/atlas-computing/links/distDirectory/nightlies/projects/nicos_web_areaDev32BS4SimOpt/NICOS_TestLog_rel_4/Simulation_G4Atlas_G4AtlasApps_G4AtlasApps_AtlasSim.loglog
            File "/afs/cern.ch/sw/lcg/external/root/5.14.00e/slc4_ia32_gcc34/root/lib/PyCintex.py", line 59, in loadDictionary
              if sc == -1 : raise "Error Loading dictionary" 
          Error Loading dictionary
          athena> 
          ApplicationMgr      FATAL finalize: Invalid state "Configured"
          ApplicationMgr       INFO Application Manager Terminated successfully
          Py:Athena            INFO leaving with code 97: "failure in finalization"
           -------------------------------- 
           FAILURE (ERROR) : test jobOptions.G4Atlas_Sim.py
           -------------------------------- 
          [ATN, test wrapper] minutes elapsed: 1 
          [ATN, test wrapper] completion of test process is detected
         

* 13.0.X-VAL rel_4 i686-slc4-gcc34-dbg Thu, 31 May 2007 05:38:29 +0200 suspicious pattern:"FAILURE (ERROR)" !!! /afs/cern.ch/atlas/software/builds/nightlies/val/AtlasSimulation/rel_4/NICOS_area/NICOS_TestLogVAL32BS4SimDbg/Simulation_G4Atlas_G4AtlasApps_G4AtlasApps_AtlasSim.loglog and(or) http://cern.ch/atlas-computing/links/distDirectory/nightlies/VALWebArea/nicos_web_areaVAL32BS4SimDbg/NICOS_TestLog_rel_4/Simulation_G4Atlas_G4AtlasApps_G4AtlasApps_AtlasSim.loglog

        File "/afs/cern.ch/sw/lcg/external/root/5.14.00e/slc4_ia32_gcc34_dbg/root/lib/PyCintex.py", line 59, in loadDictionary
          if sc == -1 : raise "Error Loading dictionary" 
      Error Loading dictionary
      athena> 
      ApplicationMgr      FATAL finalize: Invalid state "Configured"
      ApplicationMgr       INFO Application Manager Terminated successfully
      Py:Athena            INFO leaving with code 97: "failure in finalization"
       -------------------------------- 
       FAILURE (ERROR) : test jobOptions.G4Atlas_Sim.py
       -------------------------------- 
      [ATN, test wrapper] minutes elapsed: 1 
      [ATN, test wrapper] completion of test process is detected
     

  • 13.X.0 rel_3 i686-slc4-gcc34-opt Wed, 30 May 2007 10:51:58 +0200 suspicious pattern:"FAILURE (ERROR)" !!! /afs/cern.ch/atlas/software/builds/nightlies/dev/AtlasSimulation/rel_3/NICOS_area/NICOS_TestLogDev32BS4SimOpt/Simulation_G4Atlas_G4AtlasApps_G4AtlasApps_AtlasSim.loglog and(or) http://cern.ch/atlas-computing/links/distDirectory/nightlies/projects/nicos_web_areaDev32BS4SimOpt/NICOS_TestLog_rel_3/Simulation_G4Atlas_G4AtlasApps_G4AtlasApps_AtlasSim.loglog
                G4AtlasEngine::app_profiler at  _init_Physics: 
                Memory status: Virtual 495160 kB, RSS 507044 kB
                Time since beginning: 129.804374 s
         ...
          Start closing geometry.
          [ATN, test wrapper] minutes elapsed: 9 
         ...
          [ATN, test wrapper] minutes elapsed: 15 
          [ATN, test wrapper] test killed as time quota spent, test warning is issued
          nicos_kill_fam: handling process 2498 ... 
          nicos_kill_fam: killing 2498 with signal 2 
          nicos_kill_fam: killing 2511 with signal 2 
          
          Athena           CRITICAL stopped by user interrupt
          terminate called without an active exception
          /build/atnight/localbuilds/nightlies/projects/AtlasSimulation/rel_0/Simulation/G4Atlas/G4AtlasApps/test/G4AtlasApps_AtlasSim.sh: line 6:  2511 Aborted                 athena.py G4AtlasApps/jobOptions.G4Atlas_Sim.py
           -------------------------------- 
           FAILURE (ERROR) : test jobOptions.G4Atlas_Sim.py
           -------------------------------- 
         

  • 13.0.X-VAL rel_3 i686-slc4-gcc34-dbg Wed, 30 May 2007 06:02:03 +0200 suspicious pattern:"FAILURE (ERROR)" !!! /afs/cern.ch/atlas/software/builds/nightlies/val/AtlasSimulation/rel_3/NICOS_area/NICOS_TestLogVAL32BS4SimDbg/Simulation_G4Atlas_G4AtlasApps_G4AtlasApps_AtlasSim.loglog and(or) http://cern.ch/atlas-computing/links/distDirectory/nightlies/VALWebArea/nicos_web_areaVAL32BS4SimDbg/NICOS_TestLog_rel_3/Simulation_G4Atlas_G4AtlasApps_G4AtlasApps_AtlasSim.loglog
                G4AtlasEngine::app_profiler at  _init_Physics: 
                Memory status: Virtual 543082 kB, RSS 556116 kB
                Time since beginning: 664.151861 s
         ...
          Start closing geometry.
          [ATN, test wrapper] minutes elapsed: 15 
          [ATN, test wrapper] test killed as time quota spent, test warning is issued
          nicos_kill_fam: handling process 31695 ... 
          nicos_kill_fam: killing 31695 with signal 2 
          nicos_kill_fam: killing 31699 with signal 2 
          
          Athena           CRITICAL stopped by user interrupt
          terminate called without an active exception
          /build/atnight/localbuilds/nightlies/val/AtlasSimulation/rel_0/Simulation/G4Atlas/G4AtlasApps/test/G4AtlasApps_AtlasSim.sh: line 6: 31699 Aborted                 athena.py G4AtlasApps/jobOptions.G4Atlas_Sim.py
           -------------------------------- 
           FAILURE (ERROR) : test jobOptions.G4Atlas_Sim.py
           -------------------------------- 
         

  • 13.X.0 rel_2 i686-slc4-gcc34-opt Tue, 29 May 2007 11:15:33 +0200 suspicious pattern:"FAILURE (ERROR)" !!! /afs/cern.ch/atlas/software/builds/nightlies/dev/AtlasSimulation/rel_2/NICOS_area/NICOS_TestLogDev32BS4SimOpt/Simulation_G4Atlas_G4AtlasApps_G4AtlasApps_AtlasSim.loglog and(or) http://cern.ch/atlas-computing/links/distDirectory/nightlies/projects/nicos_web_areaDev32BS4SimOpt/NICOS_TestLog_rel_2/Simulation_G4Atlas_G4AtlasApps_G4AtlasApps_AtlasSim.loglog
            StorageSvc    Error Cannot connect to proper technology domain.
          PoolSvc           WARNING Failed to set POOL property, TREE_MAX_SIZE to 1099511627776L
          AthenaPoolCnvSvc  WARNING setAttribute FAILED for TREE_MAX_SIZE
          atlas_MyOutputFile.root   Always Root file version:51400
          [ATN, test wrapper] minutes elapsed: 13 
          ToolSvc.Stream1...  ERROR Could not create Rep for DataObject (clid/key):1312841250 LArCalibrationHitActive
          ToolSvc.Stream1...  ERROR Could not create Rep for DataObject (clid/key):1312841250 LArCalibrationHitDeadMaterial
          ToolSvc.Stream1...  ERROR Could not create Rep for DataObject (clid/key):1312841250 LArCalibrationHitInactive
          Stream1             ERROR streamObjects failed.
          AthenaEventLoopMgr  ERROR Terminating event processing loop due to errors
         

  • 13.0.X rel_2 i686-slc4-gcc34-opt Tue, 29 May 2007 10:26:02 +0200 suspicious pattern:"FAILURE (ERROR)" !!! /afs/cern.ch/atlas/software/builds/nightlies/bugfix/AtlasSimulation/rel_2/NICOS_area/NICOS_TestLogBF32BS4SimOpt/Simulation_G4Atlas_G4AtlasApps_G4AtlasApps_AtlasSim.loglog and(or) http://cern.ch/atlas-computing/links/distDirectory/nightlies/BFWebArea/nicos_web_areaBF32BS4SimOpt/NICOS_TestLog_rel_2/Simulation_G4Atlas_G4AtlasApps_G4AtlasApps_AtlasSim.loglog
          /afs/cern.ch/atlas/conditions/poolcond/vol0/oflcond.000002.conditions.simul.pool.v0000/oflcond.000002.conditions.simul.pool.v0000._0048.pool.root   Always Root file version:51200
          
           *** Break *** segmentation violation
          Using host libthread_db library "/lib64/tls/libthread_db.so.1".
         ...
          Thread 2 (Thread 3976018848 (LWP 16968)):
         ...
          #14 0x00b84f90 in _dl_runtime_resolve () from /lib/ld-linux.so.2
          #15 0xed763b5c in coral::ConnectionService::ConnectionPool::cleanUpTimedOutConnections ()
         ...
          Thread 1 (Thread 4159637184 (LWP 9353)):
         ...
          #6  0x00cc22bb in _dlerror_run () from /lib/libdl.so.2
          #7  0x00cc1d11 in dlopen@@GLIBC_2.1 () from /lib/libdl.so.2
          #8  0xf509de43 in seal::SharedLibrary::load ()
         ...
            File "/afs/cern.ch/atlas/offline/external/GAUDI/v19r2p4/GaudiPython/python/gaudimodule.py", line 187, in initialize
              return self._isvc.initialize()
          SystemError: problem in C++; program state has been reset
          athena> 
          ApplicationMgr      FATAL finalize: Invalid state "Configured"
          ApplicationMgr       INFO Application Manager Terminated successfully
          Py:Athena            INFO leaving with code 32: "exception raised during initialization"
          /build/atnight/localbuilds/nightlies/projects/AtlasSimulation/rel_0/Simulation/G4Atlas/G4AtlasApps/test/G4AtlasApps_AtlasSim.sh: line 6:  9353 Segmentation fault      athena.py G4AtlasApps/jobOptions.G4Atlas_Sim.py
           -------------------------------- 
           FAILURE (ERROR) : test jobOptions.G4Atlas_Sim.py
           -------------------------------- 
          [ATN, test wrapper] minutes elapsed: 1 
          [ATN, test wrapper] completion of test process is detected
         

* 13.0.X-VAL rel_2 i686-slc4-gcc34-dbg Tue, 29 May 2007 05:57:16 +0200 suspicious pattern:"FAILURE (ERROR)" !!! /afs/cern.ch/atlas/software/builds/nightlies/val/AtlasSimulation/rel_2/NICOS_area/NICOS_TestLogVAL32BS4SimDbg/Simulation_G4Atlas_G4AtlasApps_G4AtlasApps_AtlasSim.loglog and(or) http://cern.ch/atlas-computing/links/distDirectory/nightlies/VALWebArea/nicos_web_areaVAL32BS4SimDbg/NICOS_TestLog_rel_2/Simulation_G4Atlas_G4AtlasApps_G4AtlasApps_AtlasSim.loglog

        File "/afs/cern.ch/atlas/offline/external/GAUDI/v19r2p4/GaudiPython/python/gaudimodule.py", line 187, in initialize
          return self._isvc.initialize()
      SystemError: problem in C++; program state has been reset
      athena> 
      ApplicationMgr      FATAL finalize: Invalid state "Configured"
      ApplicationMgr       INFO Application Manager Terminated successfully
      Py:Athena            INFO leaving with code 32: "exception raised during initialization"
       -------------------------------- 
       FAILURE (ERROR) : test jobOptions.G4Atlas_Sim.py
       -------------------------------- 
      [ATN, test wrapper] minutes elapsed: 4 
      [ATN, test wrapper] completion of test process is detected
     

  • 13.0.X rel_2 i686-slc3-gcc323-opt Tue, 29 May 2007 05:21:54 +0200 suspicious pattern:"FAILURE (ERROR)" !!! /afs/cern.ch/atlas/software/builds/nightlies/bugfix/AtlasSimulation/rel_2/NICOS_area/NICOS_TestLogBF32BS3SimOpt/Simulation_G4Atlas_G4AtlasApps_G4AtlasApps_AtlasSim.loglog and(or) http://cern.ch/atlas-computing/links/distDirectory/nightlies/BFWebArea/nicos_web_areaBF32BS3SimOpt/NICOS_TestLog_rel_2/Simulation_G4Atlas_G4AtlasApps_G4AtlasApps_AtlasSim.loglog
                G4AtlasEngine::app_profiler at  _init_Physics: 
                Memory status: Virtual 492289 kB, RSS 307456 kB
                Time since beginning: 329.466767 s
         ...
          Start closing geometry.
          [ATN, test wrapper] minutes elapsed: 10 
         ...
          [ATN, test wrapper] minutes elapsed: 15 
          [ATN, test wrapper] test killed as time quota spent, test warning is issued
          nicos_kill_fam: handling process 18281 ... 
          
          Athena           CRITICAL stopped bynicos_kill_fam: killing 18281 with signal 2 
          nicos_kill_fam: killing 18282 with signal 2 
           user interrupt
          /build/atnight/localbuilds/nightlies/projects/AtlasSimulation/rel_0/Simulation/G4Atlas/G4AtlasApps/test/G4AtlasApps_AtlasSim.sh: line 6: 18282 Aborted                 athena.py G4AtlasApps/jobOptions.G4Atlas_Sim.py
           -------------------------------- 
           FAILURE (ERROR) : test jobOptions.G4Atlas_Sim.py
           -------------------------------- 
         

  • 13.X.0 rel_1 i686-slc4-gcc34-opt Mon, 28 May 2007 10:36:06 +0200 suspicious pattern:"FAILURE (ERROR)" !!! /afs/cern.ch/atlas/software/builds/nightlies/dev/AtlasSimulation/rel_1/NICOS_area/NICOS_TestLogDev32BS4SimOpt/Simulation_G4Atlas_G4AtlasApps_G4AtlasApps_AtlasSim.loglog and(or) http://cern.ch/atlas-computing/links/distDirectory/nightlies/projects/nicos_web_areaDev32BS4SimOpt/NICOS_TestLog_rel_1/Simulation_G4Atlas_G4AtlasApps_G4AtlasApps_AtlasSim.loglog
            StorageSvc    Error Cannot connect to proper technology domain.
          PoolSvc           WARNING Failed to set POOL property, TREE_MAX_SIZE to 1099511627776L
          AthenaPoolCnvSvc  WARNING setAttribute FAILED for TREE_MAX_SIZE
          atlas_MyOutputFile.root   Always Root file version:51400
          ToolSvc.Stream1...  ERROR Could not create Rep for DataObject (clid/key):1312841250 LArCalibrationHitActive
          ToolSvc.Stream1...  ERROR Could not create Rep for DataObject (clid/key):1312841250 LArCalibrationHitDeadMaterial
          ToolSvc.Stream1...  ERROR Could not create Rep for DataObject (clid/key):1312841250 LArCalibrationHitInactive
          Stream1             ERROR streamObjects failed.
          AthenaEventLoopMgr  ERROR Terminating event processing loop due to errors
    
         ...
    
              End of run - time spent is 7.4800
    
         ...
    
           -------------------------------- 
           FAILURE (ERROR) : test jobOptions.G4Atlas_Sim.py
           -------------------------------- 
          [ATN, test wrapper] minutes elapsed: 15 
          [ATN, test wrapper] completion of test process is detected
         

  • 13.0.X rel_1 i686-slc3-gcc323-opt Mon, 28 May 2007 06:40:09 +0200 suspicious pattern:"FAILURE (ERROR)" !!! /afs/cern.ch/atlas/software/builds/nightlies/bugfix/AtlasSimulation/rel_1/NICOS_area/NICOS_TestLogBF32BS3SimOpt/Simulation_G4Atlas_G4AtlasApps_G4AtlasApps_AtlasSim.loglog and(or) http://cern.ch/atlas-computing/links/distDirectory/nightlies/BFWebArea/nicos_web_areaBF32BS3SimOpt/NICOS_TestLog_rel_1/Simulation_G4Atlas_G4AtlasApps_G4AtlasApps_AtlasSim.loglog
          Start closing geometry.
          [ATN, test wrapper] minutes elapsed: 7 
         ...
                G4AtlasEngine::app_profiler at  PyG4AtlasAlg end of initialize  
                Memory status: Virtual 670953 kB, RSS 477752 kB
                Time since beginning: 784.571767 s
         ...
              End of Event nr. 1
              Time spent generating the last event was 4.1800
              Average time per event until now is nan +- nan
         ...
              End of Event nr. 2
              Time spent generating the last event was 4.1700
              Average time per event until now is 4.1700 +- nan
         ...
              End of Event nr. 3
              Time spent generating the last event was 3.9200
              Average time per event until now is 4.0450 +- 0.1250
         ...
              End of run - time spent is 21.7900
              Average time per event was 4.0450 +- 0.1250
         ...
          [ATN, test wrapper] minutes elapsed: 15 
          [ATN, test wrapper] test killed as time quota spent, test warning is issued
          nicos_kill_fam: handling process 29278 ... 
          nicos_kill_fam: killing 29278 with signal 2 
          nicos_kill_fam: killing 29281 with signal 2 
          
          Athena           CRITICAL stopped by user interrupt
          /build/atnight/localbuilds/nightlies/projects/AtlasSimulation/rel_0/Simulation/G4Atlas/G4AtlasApps/test/G4AtlasApps_AtlasSim.sh: line 6: 29281 Aborted                 athena.py G4AtlasApps/jobOptions.G4Atlas_Sim.py
           -------------------------------- 
           FAILURE (ERROR) : test jobOptions.G4Atlas_Sim.py
           -------------------------------- 
         

  • 13.0.X-VAL rel_1 i686-slc4-gcc34-dbg Mon, 28 May 2007 06:08:44 +0200 suspicious pattern:"FAILURE (ERROR)" !!! /afs/cern.ch/atlas/software/builds/nightlies/val/AtlasSimulation/rel_1/NICOS_area/NICOS_TestLogVAL32BS4SimDbg/Simulation_G4Atlas_G4AtlasApps_G4AtlasApps_AtlasSim.loglog and(or) http://cern.ch/atlas-computing/links/distDirectory/nightlies/VALWebArea/nicos_web_areaVAL32BS4SimDbg/NICOS_TestLog_rel_1/Simulation_G4Atlas_G4AtlasApps_G4AtlasApps_AtlasSim.loglog
                G4AtlasEngine::app_profiler at  _init_Physics: 
                Memory status: Virtual 542261 kB, RSS 555276 kB
                Time since beginning: 733.533567 s
    ...
          ########### initializing the G4Run ############
          [ATN, test wrapper] minutes elapsed: 13 
    ...
          msc:  Model variant of multiple scattering for e-
                Lambda tables from 100 eV  to 100 TeV in 120 bins.
                Boundary/stepping algorithm is active with facrange= 0.2  Step limitation 0
          [ATN, test wrapper] minutes elapsed: 15 
          [ATN, test wrapper] test killed as time quota spent, test warning is issued
          nicos_kill_fam: handling process 4400 ... 
          nicos_kill_fam: killing 4400 with signal 2 
          nicos_kill_fam: killing 4401 with signal 2 
          
          Athena           CRITICAL stopped by user interrupt
          terminate called without an active exception
          /build/atnight/localbuilds/nightlies/val/AtlasSimulation/rel_0/Simulation/G4Atlas/G4AtlasApps/test/G4AtlasApps_AtlasSim.sh: line 6:  4401 Aborted                 athena.py G4AtlasApps/jobOptions.G4Atlas_Sim.py
           -------------------------------- 
           FAILURE (ERROR) : test jobOptions.G4Atlas_Sim.py
           -------------------------------- 
         

  • 13.X.0 rel_0 i686-slc4-gcc34-opt Sun, 27 May 2007 10:52:17 +0200 suspicious pattern:"FAILURE (ERROR)" !!! /afs/cern.ch/atlas/software/builds/nightlies/dev/AtlasSimulation/rel_0/NICOS_area/NICOS_TestLogDev32BS4SimOpt/Simulation_G4Atlas_G4AtlasApps_G4AtlasApps_AtlasSim.loglog and(or) http://cern.ch/atlas-computing/links/distDirectory/nightlies/projects/nicos_web_areaDev32BS4SimOpt/NICOS_TestLog_rel_0/Simulation_G4Atlas_G4AtlasApps_G4AtlasApps_AtlasSim.loglog
                G4AtlasEngine::app_profiler at  _init_Physics: 
                Memory status: Virtual 495949 kB, RSS 507852 kB
                Time since beginning: 116.414536 s
    ...
          Start closing geometry.
          [ATN, test wrapper] minutes elapsed: 9 
    ...
          [ATN, test wrapper] minutes elapsed: 15 
          [ATN, test wrapper] test killed as time quota spent, test warning is issued
          nicos_kill_fam: handling process 23826 ... 
          nicos_kill_fam: killing 23826 with signal 2 
          nicos_kill_fam: killing 23837 with signal 2 
          
          Athena           CRITICAL stopped by user interrupt
          terminate called without an active exception
          /build/atnight/localbuilds/nightlies/projects/AtlasSimulation/rel_0/Simulation/G4Atlas/G4AtlasApps/test/G4AtlasApps_AtlasSim.sh: line 6: 23837 Aborted                 athena.py G4AtlasApps/jobOptions.G4Atlas_Sim.py
           -------------------------------- 
           FAILURE (ERROR) : test jobOptions.G4Atlas_Sim.py
           -------------------------------- 
         

  • 13.0.X-VAL rel_0 i686-slc4-gcc34-dbg Sun, 27 May 2007 06:01:38 +0200 suspicious pattern:"FAILURE (ERROR)" !!! /afs/cern.ch/atlas/software/builds/nightlies/val/AtlasSimulation/rel_0/NICOS_area/NICOS_TestLogVAL32BS4SimDbg/Simulation_G4Atlas_G4AtlasApps_G4AtlasApps_AtlasSim.loglog and(or) http://cern.ch/atlas-computing/links/distDirectory/nightlies/VALWebArea/nicos_web_areaVAL32BS4SimDbg/NICOS_TestLog_rel_0/Simulation_G4Atlas_G4AtlasApps_G4AtlasApps_AtlasSim.loglog
            File "/afs/cern.ch/atlas/offline/external/GAUDI/v19r2p4/GaudiPython/python/gaudimodule.py", line 187, in initialize
              return self._isvc.initialize()
          SystemError: problem in C++; program state has been reset
          athena> 
          
           *** Break *** segmentation violation
          ApplicationMgr      FATAL finalize: Invalid state "Configured"
          ApplicationMgr       INFO Application Manager Terminated successfully
          Py:Athena            INFO leaving with code 32: "exception raised during initialization"
          /build/atnight/localbuilds/nightlies/val/AtlasSimulation/rel_0/Simulation/G4Atlas/G4AtlasApps/test/G4AtlasApps_AtlasSim.sh: line 6:  1512 Segmentation fault      athena.py G4AtlasApps/jobOptions.G4Atlas_Sim.py
           -------------------------------- 
           FAILURE (ERROR) : test jobOptions.G4Atlas_Sim.py
           -------------------------------- 
          [ATN, test wrapper] minutes elapsed: 6 
          [ATN, test wrapper] completion of test process is detected
         

  • 13.X.0 rel_6 i686-slc4-gcc34-opt Sat, 26 May 2007 11:01:20 +0200 suspicious pattern:"FAILURE (ERROR)" !!! /afs/cern.ch/atlas/software/builds/nightlies/dev/AtlasSimulation/rel_6/NICOS_area/NICOS_TestLogDev32BS4SimOpt/Simulation_G4Atlas_G4AtlasApps_G4AtlasApps_AtlasSim.loglog and(or) http://cern.ch/atlas-computing/links/distDirectory/nightlies/projects/nicos_web_areaDev32BS4SimOpt/NICOS_TestLog_rel_6/Simulation_G4Atlas_G4AtlasApps_G4AtlasApps_AtlasSim.loglog
            StorageSvc    Error Cannot connect to proper technology domain.
          PoolSvc           WARNING Failed to set POOL property, TREE_MAX_SIZE to 1099511627776L
          AthenaPoolCnvSvc  WARNING setAttribute FAILED for TREE_MAX_SIZE
          atlas_MyOutputFile.root   Always Root file version:51400
          [ATN, test wrapper] minutes elapsed: 15 
          [ATN, test wrapper] test killed as time quota spent, test warning is issued
          nicos_kill_fam: handling process 28022 ... 
          
          nicos_kill_fam: killing 28022 with signal 2 
          nicos_kill_fam: killing 28025 with signal 2 
          Athena           CRITICAL stopped by user interrupt
          terminate called without an active exception
          /build/atnight/localbuilds/nightlies/projects/AtlasSimulation/rel_0/Simulation/G4Atlas/G4AtlasApps/test/G4AtlasApps_AtlasSim.sh: line 6: 28025 Aborted                 athena.py G4AtlasApps/jobOptions.G4Atlas_Sim.py
           -------------------------------- 
           FAILURE (ERROR) : test jobOptions.G4Atlas_Sim.py
           -------------------------------- 
         

  • 13.0.X rel_6 i686-slc4-gcc34-opt Sat, 26 May 2007 10:27:15 +0200 suspicious pattern:"FAILURE (ERROR)" !!! /afs/cern.ch/atlas/software/builds/nightlies/bugfix/AtlasSimulation/rel_6/NICOS_area/NICOS_TestLogBF32BS4SimOpt/Simulation_G4Atlas_G4AtlasApps_G4AtlasApps_AtlasSim.loglog and(or) http://cern.ch/atlas-computing/links/distDirectory/nightlies/BFWebArea/nicos_web_areaBF32BS4SimOpt/NICOS_TestLog_rel_6/Simulation_G4Atlas_G4AtlasApps_G4AtlasApps_AtlasSim.loglog
            File "/afs/cern.ch/atlas/offline/external/GAUDI/v19r2p4/GaudiPython/python/gaudimodule.py", line 187, in initialize
              return self._isvc.initialize()
          SystemError: problem in C++; program state has been reset
          athena> 
          ApplicationMgr      FATAL finalize: Invalid state "Configured"
          ApplicationMgr       INFO Application Manager Terminated successfully
          Py:Athena            INFO leaving with code 32: "exception raised during initialization"
          /build/atnight/localbuilds/nightlies/projects/AtlasSimulation/rel_0/Simulation/G4Atlas/G4AtlasApps/test/G4AtlasApps_AtlasSim.sh: line 6: 25708 Segmentation fault      athena.py G4AtlasApps/jobOptions.G4Atlas_Sim.py
           -------------------------------- 
           FAILURE (ERROR) : test jobOptions.G4Atlas_Sim.py
           -------------------------------- 
          [ATN, test wrapper] minutes elapsed: 1 
          [ATN, test wrapper] completion of test process is detected
         

  • 13.0.X-VAL rel_6 i686-slc4-gcc34-dbg Sat, 26 May 2007 06:06:20 +0200 suspicious pattern:"FAILURE (ERROR)" !!! /afs/cern.ch/atlas/software/builds/nightlies/val/AtlasSimulation/rel_6/NICOS_area/NICOS_TestLogVAL32BS4SimDbg/Simulation_G4Atlas_G4AtlasApps_G4AtlasApps_AtlasSim.loglog and(or) http://cern.ch/atlas-computing/links/distDirectory/nightlies/VALWebArea/nicos_web_areaVAL32BS4SimDbg/NICOS_TestLog_rel_6/Simulation_G4Atlas_G4AtlasApps_G4AtlasApps_AtlasSim.loglog
                G4AtlasEngine::app_profiler at  _init_Physics: 
                Memory status: Virtual 543253 kB, RSS 556292 kB
                Time since beginning: 806.692233 s
                                                            
          Py:G4AtlasApps::PyG4Atlas    DEBUG  G4AtlasEngine: _init_G4: init Geant4 
           creating the python interface to G4 
          ++++++++ G4Svc being initialized NOW! +++++++
          userDetector->Construct() start.
          Atlas::Atlas is registered to the default region.
          physicsList->Construct() start.
          ### Adding Neutron tracking cut for neutron
          ###  cut value is 10 microseconds
          physicsList->setCut() start.
          ########### initializing the G4Run ############
          [ATN, test wrapper] minutes elapsed: 14 
          [ATN, test wrapper] minutes elapsed: 15 
          [ATN, test wrapper] test killed as time quota spent, test warning is issued
          nicos_kill_fam: handling process 16749 ... 
          nicos_kill_fam: killing 16749 with signal 2 
          nicos_kill_fam: killing 16778 with signal 2 
          
          Athena           CRITICAL stopped by user interrupt
          terminate called without an active exception
          /build/atnight/localbuilds/nightlies/val/AtlasSimulation/rel_0/Simulation/G4Atlas/G4AtlasApps/test/G4AtlasApps_AtlasSim.sh: line 6: 16778 Aborted                 athena.py G4AtlasApps/jobOptions.G4Atlas_Sim.py
           -------------------------------- 
           FAILURE (ERROR) : test jobOptions.G4Atlas_Sim.py
           -------------------------------- 
         

  • Fri, 25 May 2007 11:45:22 +0200 , 13.0.X release rel_5 i686-slc3-gcc323-opt. suspicious pattern:"FAILURE (ERROR)" !!! /afs/cern.ch/atlas/software/builds/nightlies/bugfix/AtlasSimulation/rel_5/NICOS_area/NICOS_TestLogBF32BS3SimOpt/Simulation_G4Atlas_G4AtlasApps_G4AtlasApps_AtlasSim.loglog and(or) http://cern.ch/atlas-computing/links/distDirectory/nightlies/BFWebArea/nicos_web_areaBF32BS3SimOpt/NICOS_TestLog_rel_5/Simulation_G4Atlas_G4AtlasApps_G4AtlasApps_AtlasSim.loglog
            File "/build/atnight/localbuilds/nightlies/projects/AtlasSimulation/rel_0/InstallArea/python/G4AtlasApps/PyG4Atlas.py", line 2077, in _do_PreInit
              raise RuntimeError('SimSkeleton: found problems with the '+\
          RuntimeError: SimSkeleton: found problems with the method  _do_persitency
          athena> 
          ApplicationMgr      FATAL finalize: Invalid state "Configured"
          ApplicationMgr       INFO Application Manager Terminated successfully
          Py:Athena            INFO leaving with code 97: "failure in finalization"
           -------------------------------- 
           FAILURE (ERROR) : test jobOptions.G4Atlas_Sim.py
           -------------------------------- 
          [ATN, test wrapper] minutes elapsed: 1 
          [ATN, test wrapper] completion of test process is detected
          

  • Fri, 25 May 2007 11:06:23 +0200 , 13.X.0 release rel_5 i686-slc4-gcc34-opt. suspicious pattern:"FAILURE (ERROR)" !!! /afs/cern.ch/atlas/software/builds/nightlies/dev/AtlasSimulation/rel_5/NICOS_area/NICOS_TestLogDev32BS4SimOpt/Simulation_G4Atlas_G4AtlasApps_G4AtlasApps_AtlasSim.loglog and(or) http://cern.ch/atlas-computing/links/distDirectory/nightlies/projects/nicos_web_areaDev32BS4SimOpt/NICOS_TestLog_rel_5/Simulation_G4Atlas_G4AtlasApps_G4AtlasApps_AtlasSim.loglog
                G4AtlasEngine::app_profiler at  _init_Physics: 
                Memory status: Virtual 500941 kB, RSS 512964 kB
                Time since beginning: 116.497916 s
         ...
          Start closing geometry.
          [ATN, test wrapper] minutes elapsed: 9 
         ...
    
          [ATN, test wrapper] minutes elapsed: 15 
          [ATN, test wrapper] test killed as time quota spent, test warning is issued
          nicos_kill_fam: handling process 18031 ... 
          nicos_kill_fam: killing 18031 with signal 2 
          nicos_kill_fam: killing 18044 with signal 2 
          
          Athena           CRITICAL stopped by user interrupt
          terminate called without an active exception
          /build/atnight/localbuilds/nightlies/projects/AtlasSimulation/rel_0/Simulation/G4Atlas/G4AtlasApps/test/G4AtlasApps_AtlasSim.sh: line 6: 18044 Aborted                 athena.py G4AtlasApps/jobOptions.G4Atlas_Sim.py
           -------------------------------- 
           FAILURE (ERROR) : test jobOptions.G4Atlas_Sim.py
           -------------------------------- 
         

  • Fri, 25 May 2007 06:16:55 +0200 , 13.0.X-VAL release rel_5 i686-slc4-gcc34-dbg. suspicious pattern:"FAILURE (ERROR)" !!! /afs/cern.ch/atlas/software/builds/nightlies/val/AtlasSimulation/rel_5/NICOS_area/NICOS_TestLogVAL32BS4SimDbg/Simulation_G4Atlas_G4AtlasApps_G4AtlasApps_AtlasSim.loglog and(or) http://cern.ch/atlas-computing/links/distDirectory/nightlies/VALWebArea/nicos_web_areaVAL32BS4SimDbg/NICOS_TestLog_rel_5/Simulation_G4Atlas_G4AtlasApps_G4AtlasApps_AtlasSim.loglog
          [ATN, test wrapper] minutes elapsed: 15 
          [ATN, test wrapper] test killed as time quota spent, test warning is issued
          nicos_kill_fam: handling process 17611 ... 
          
          nicos_kill_fam: killing 17611 with signal 2 
          nicos_kill_fam: killing 17655 with signal 2 
          Athena           CRITICAL stopped by user interrupt
          terminate called without an active exception
          /build/atnight/localbuilds/nightlies/val/AtlasSimulation/rel_0/Simulation/G4Atlas/G4AtlasApps/test/G4AtlasApps_AtlasSim.sh: line 6: 17655 Aborted                 athena.py G4AtlasApps/jobOptions.G4Atlas_Sim.py
           -------------------------------- 
           FAILURE (ERROR) : test jobOptions.G4Atlas_Sim.py
           -------------------------------- 
        

  • Thu, 24 May 2007 10:56:13 +0200 , 13.X.0 release rel_4 i686-slc4-gcc34-opt. suspicious pattern:"FAILURE (ERROR)" !!! /afs/cern.ch/atlas/software/builds/nightlies/dev/AtlasSimulation/rel_4/NICOS_area/NICOS_TestLogDev32BS4SimOpt/Simulation_G4Atlas_G4AtlasApps_G4AtlasApps_AtlasSim.loglog and(or) http://cern.ch/atlas-computing/links/distDirectory/nightlies/projects/nicos_web_areaDev32BS4SimOpt/NICOS_TestLog_rel_4/Simulation_G4Atlas_G4AtlasApps_G4AtlasApps_AtlasSim.loglog
          [ATN, test wrapper] minutes elapsed: 15 
          [ATN, test wrapper] test killed as time quota spent, test warning is issued
          nicos_kill_fam: handling process 18294 ... 
          nicos_kill_fam: killing 18294 with signal 2 
          nicos_kill_fam: killing 18306 with signal 2 
          
          Athena           CRITICAL stopped by user interrupt
          terminate called without an active exception
          /build/atnight/localbuilds/nightlies/projects/AtlasSimulation/rel_0/Simulation/G4Atlas/G4AtlasApps/test/G4AtlasApps_AtlasSim.sh: line 6: 18306 Aborted                 athena.py G4AtlasApps/jobOptions.G4Atlas_Sim.py
           -------------------------------- 
           FAILURE (ERROR) : test jobOptions.G4Atlas_Sim.py
           -------------------------------- 
         

  • Thu, 24 May 2007 10:46:33 +0200 , 13.0.X release rel_4 i686-slc4-gcc34-opt. suspicious pattern:"FAILURE (ERROR)" !!! /afs/cern.ch/atlas/software/builds/nightlies/bugfix/AtlasSimulation/rel_4/NICOS_area/NICOS_TestLogBF32BS4SimOpt/Simulation_G4Atlas_G4AtlasApps_G4AtlasApps_AtlasSim.loglog and(or) http://cern.ch/atlas-computing/links/distDirectory/nightlies/BFWebArea/nicos_web_areaBF32BS4SimOpt/NICOS_TestLog_rel_4/Simulation_G4Atlas_G4AtlasApps_G4AtlasApps_AtlasSim.loglog
            File "/afs/cern.ch/atlas/offline/external/GAUDI/v19r2p4/GaudiPython/python/gaudimodule.py", line 187, in initialize
              return self._isvc.initialize()
          SystemError: problem in C++; program state has been reset
          athena> 
          ApplicationMgr      FATAL finalize: Invalid state "Configured"
          ApplicationMgr       INFO Application Manager Terminated successfully
          Py:Athena            INFO leaving with code 32: "exception raised during initialization"
          
           *** Break *** segmentation violation
          /build/atnight/localbuilds/nightlies/projects/AtlasSimulation/rel_0/Simulation/G4Atlas/G4AtlasApps/test/G4AtlasApps_AtlasSim.sh: line 6: 32058 Segmentation fault      athena.py G4AtlasApps/jobOptions.G4Atlas_Sim.py
           -------------------------------- 
           FAILURE (ERROR) : test jobOptions.G4Atlas_Sim.py
           -------------------------------- 
          [ATN, test wrapper] minutes elapsed: 2 
        

  • Thu, 24 May 2007 08:31:32 +0200 13.0.X release rel_4 i686-slc3-gcc323-opt. suspicious pattern:"FAILURE (ERROR)" !!! /afs/cern.ch/atlas/software/builds/nightlies/bugfix/AtlasSimulation/rel_4/NICOS_area/NICOS_TestLogBF32BS3SimOpt/Simulation_G4Atlas_G4AtlasApps_G4AtlasApps_AtlasSim.loglog and(or) http://cern.ch/atlas-computing/links/distDirectory/nightlies/BFWebArea/nicos_web_areaBF32BS3SimOpt/NICOS_TestLog_rel_4/Simulation_G4Atlas_G4AtlasApps_G4AtlasApps_AtlasSim.loglog
            File "/build/atnight/localbuilds/nightlies/projects/AtlasSimulation/rel_0/InstallArea/python/G4AtlasApps/PyG4Atlas.py", line 2077, in _do_PreInit
              raise RuntimeError('SimSkeleton: found problems with the '+\
          RuntimeError: SimSkeleton: found problems with the method  _do_persitency
          athena> 
          ApplicationMgr      FATAL finalize: Invalid state "Configured"
          ApplicationMgr       INFO Application Manager Terminated successfully
          Py:Athena            INFO leaving with code 97: "failure in finalization"
           -------------------------------- 
           FAILURE (ERROR) : test jobOptions.G4Atlas_Sim.py
           -------------------------------- 
          [ATN, test wrapper] minutes elapsed: 1 
          [ATN, test wrapper] completion of test process is detected
         

  • Thu, 24 May 2007 06:07:11 +0200 13.0.X-VAL release rel_4 i686-slc4-gcc34-dbg. suspicious pattern:"FAILURE (ERROR)" !!! /afs/cern.ch/atlas/software/builds/nightlies/val/AtlasSimulation/rel_4/NICOS_area/NICOS_TestLogVAL32BS4SimDbg/Simulation_G4Atlas_G4AtlasApps_G4AtlasApps_AtlasSim.loglog and(or) http://cern.ch/atlas-computing/links/distDirectory/nightlies/VALWebArea/nicos_web_areaVAL32BS4SimDbg/NICOS_TestLog_rel_4/Simulation_G4Atlas_G4AtlasApps_G4AtlasApps_AtlasSim.loglog
            File "/afs/cern.ch/atlas/offline/external/GAUDI/v19r2p4/GaudiPython/python/gaudimodule.py", line 187, in initialize
              return self._isvc.initialize()
          SystemError: problem in C++; program state has been reset
          athena> 
          
           *** Break *** segmentation violation
          ApplicationMgr      FATAL finalize: Invalid state "Configured"
          ApplicationMgr       INFO Application Manager Terminated successfully
          Py:Athena            INFO leaving with code 32: "exception raised during initialization"
           -------------------------------- 
           FAILURE (ERROR) : test jobOptions.G4Atlas_Sim.py
           -------------------------------- 
          [ATN, test wrapper] minutes elapsed: 7 
          [ATN, test wrapper] completion of test process is detected
         

  • Wed, 23 May 2007 09:35:05 +0200 13.0.X release rel_3 i686-slc3-gcc323-opt. suspicious pattern:"FAILURE (ERROR)" !!! /afs/cern.ch/atlas/software/builds/nightlies/bugfix/AtlasSimulation/rel_3/NICOS_area/NICOS_TestLogBF32BS3SimOpt/Simulation_G4Atlas_G4AtlasApps_G4AtlasApps_AtlasSim.loglog and(or) http://cern.ch/atlas-computing/links/distDirectory/nightlies/BFWebArea/nicos_web_areaBF32BS3SimOpt/NICOS_TestLog_rel_3/Simulation_G4Atlas_G4AtlasApps_G4AtlasApps_AtlasSim.loglog
              raise RuntimeError('SimSkeleton: found problems with the '+\
          RuntimeError: SimSkeleton: found problems with the method  _do_persitency
          athena> 
          ApplicationMgr      FATAL finalize: Invalid state "Configured"
          ApplicationMgr       INFO Application Manager Terminated successfully
          Py:Athena            INFO leaving with code 97: "failure in finalization"
           -------------------------------- 
           FAILURE (ERROR) : test jobOptions.G4Atlas_Sim.py
           -------------------------------- 
          [ATN, test wrapper] minutes elapsed: 1 
          [ATN, test wrapper] completion of test process is detected
          

  • Wed, 23 May 2007 05:50:11 +0200 13.0.X-VAL release rel_3 i686-slc4-gcc34-dbg. NICOS: suspicious pattern:"FAILURE (ERROR)" !!! /afs/cern.ch/atlas/software/builds/nightlies/val/AtlasSimulation/rel_3/NICOS_area/NICOS_TestLogVAL32BS4SimDbg/Simulation_G4Atlas_G4AtlasApps_G4AtlasApps_AtlasSim.loglog and(or) http://cern.ch/atlas-computing/links/distDirectory/nightlies/VALWebArea/nicos_web_areaVAL32BS4SimDbg/NICOS_TestLog_rel_3/Simulation_G4Atlas_G4AtlasApps_G4AtlasApps_AtlasSim.loglog
            File "/afs/cern.ch/atlas/offline/external/GAUDI/v19r2p4/GaudiPython/python/gaudimodule.py", line 187, in initialize
              return self._isvc.initialize()
          SystemError: problem in C++; program state has been reset
          athena> 
          ApplicationMgr      FATAL finalize: Invalid state "Configured"
          ApplicationMgr       INFO Application Manager Terminated successfully
          Py:Athena            INFO leaving with code 32: "exception raised during initialization"
          
           *** Break *** segmentation violation
          
           *** Break *** segmentation violation
          Using host libthread_db library "/lib64/tls/libthread_db.so.1".
          Attaching to program: /proc/22449/exe, process 22449
          ptrace: Operation not permitted.
          /build/atnight/localbuilds/nightlies/val/AtlasSimulation/rel_0/NICOS_area/NICOS_qmtestVAL32BS4SimDbg/g4atlasapps_atlassim_work/22449: No such file or directory.
          [ATN, test wrapper] minutes elapsed: 6 
           -------------------------------- 
           FAILURE (ERROR) : test jobOptions.G4Atlas_Sim.py
           -------------------------------- 
          Using host libthread_db library "/lib64/tls/libthread_db.so.1".
          Attaching to program: /proc/22449/exe, process 22449
          `shared object read from target memory' has disappeared; keeping its symbols.
          [Thread debugging using libthread_db enabled]
    
          ....
    
          #44 0xf7ebe200 in ?? ()
          #45 0x00000000 in ?? ()
          [ATN, test wrapper] minutes elapsed: 7 
          [ATN, test wrapper] completion of test process is detected
         

  • Tue, 22 May 2007 22:59:48 +0200
    • 13.0.X release rel_2 i686-slc4-gcc34-opt. NICOS: suspicious pattern:"FAILURE (ERROR)" !!! /afs/cern.ch/atlas/software/builds/nightlies/bugfix/AtlasSimulation/rel_2/NICOS_area/NICOS_TestLogBF32BS4SimOpt/Simulation_G4Atlas_G4AtlasApps_G4AtlasApps_AtlasSim.loglog and(or) http://cern.ch/atlas-computing/links/distDirectory/nightlies/BFWebArea/nicos_web_areaBF32BS4SimOpt/NICOS_TestLog_rel_2/Simulation_G4Atlas_G4AtlasApps_G4AtlasApps_AtlasSim.loglog
            Thread 1 (Thread 4159637184 (LWP 16420)):
            #0  0x00b8b5ca in strcmp () from /lib/ld-linux.so.2
            #1  0x00b81989 in do_lookup_x () from /lib/ld-linux.so.2
            #2  0x00b81ca2 in _dl_lookup_symbol_x () from /lib/ld-linux.so.2
            #3  0x00b83144 in _dl_relocate_object () from /lib/ld-linux.so.2
            #4  0x00c9013a in dl_open_worker () from /lib/tls/libc.so.6
            #5  0x00b854ee in _dl_catch_error () from /lib/ld-linux.so.2
            #6  0x00c90b88 in _dl_open () from /lib/tls/libc.so.6
            #7  0x00cc1cb8 in dlopen_doit () from /lib/libdl.so.2
            #8  0x00b854ee in _dl_catch_error () from /lib/ld-linux.so.2
            #9  0x00cc22bb in _dlerror_run () from /lib/libdl.so.2
            #10 0x00cc1d11 in dlopen@@GLIBC_2.1 () from /lib/libdl.so.2
            #11 0xf5255e43 in seal::SharedLibrary::load ()
               from /afs/cern.ch/atlas/offline/external/LCGCMT/LCGCMT_51/InstallArea/i686-slc4-gcc34-opt/lib/liblcg_SealBase.so
      
            ...
      
              File "/afs/cern.ch/atlas/offline/external/GAUDI/v19r2p4/GaudiPython/python/gaudimodule.py", line 187, in initialize
                return self._isvc.initialize()
            SystemError: problem in C++; program state has been reset
            athena> 
            
             *** Break *** segmentation violation
            ApplicationMgr      FATAL finalize: Invalid state "Configured"
            ApplicationMgr       INFO Application Manager Terminated successfully
            Py:Athena            INFO leaving with code 32: "exception raised during initialization"
             -------------------------------- 
             FAILURE (ERROR) : test jobOptions.G4Atlas_Sim.py
             -------------------------------- 
            [ATN, test wrapper] minutes elapsed: 1 
            [ATN, test wrapper] completion of test process is detected
          

  • Tue, 22 May 2007 05:46:57 +0200
    • 13.0.X-VAL release rel_2 i686-slc4-gcc34-dbg. NICOS: suspicious pattern:"FAILURE (ERROR)" !!! /afs/cern.ch/atlas/software/builds/nightlies/val/AtlasSimulation/rel_2/NICOS_area/NICOS_TestLogVAL32BS4SimDbg/Simulation_G4Atlas_G4AtlasApps_G4AtlasApps_AtlasSim.loglog and(or) http://cern.ch/atlas-computing/links/distDirectory/nightlies/VALWebArea/nicos_web_areaVAL32BS4SimDbg/NICOS_TestLog_rel_2/Simulation_G4Atlas_G4AtlasApps_G4AtlasApps_AtlasSim.loglog
            
              File "/afs/cern.ch/atlas/offline/external/GAUDI/v19r2p4/GaudiPython/python/gaudimodule.py", line 187, in initialize
                return self._isvc.initialize()
            SystemError: problem in C++; program state has been reset
            athena> 
            
             *** Break *** segmentation violation
            ApplicationMgr      FATAL finalize: Invalid state "Configured"
            ApplicationMgr       INFO Application Manager Terminated successfully
            Py:Athena            INFO leaving with code 32: "exception raised during initialization"
             -------------------------------- 
             FAILURE (ERROR) : test jobOptions.G4Atlas_Sim.py
             -------------------------------- 
            [ATN, test wrapper] minutes elapsed: 6 
            [ATN, test wrapper] completion of test process is detected
          

  • Mon, 21 May 2007 14:19:47 +0200 13.0.X-VAL release rel_1 i686-slc4-gcc34-dbg. NICOS: suspicious pattern:"FAILURE (ERROR)" !!! * second report for the same build (with different pattern)...?

  • Mon, 21 May 2007 09:33:36 +0200 13.X.0 release rel_1 i686-slc4-gcc34-opt. NICOS: suspicious pattern:"No such file or directory" !!! /afs/cern.ch/atlas/software/builds/nightlies/dev/AtlasSimulation/rel_1/NICOS_TestLogDev32BS4SimOpt/Simulation_G4Atlas_G4AtlasApps_G4AtlasApps_AtlasSim.loglog and(or) http://cern.ch/atlas-computing/links/distDirectory/nightlies/projects/nicos_web_areaDev32BS4SimOpt/NICOS_TestLog_rel_1/Simulation_G4Atlas_G4AtlasApps_G4AtlasApps_AtlasSim.loglog
          DllClassManager     ERROR Could not load module AthenaServices
          DllClassManager     ERROR System Error: libAthenaServices.so: cannot open shared object file: No such file or directory
          ApplicationMgr       INFO Successfully loaded modules : 
          ApplicationMgr    WARNING Failed to load modules: AthenaServices
          ApplicationMgr      ERROR Failure loading declared DLL's
    
          ...
    
            File "/build/atnight/localbuilds/nightlies/projects/AtlasCore/rel_0/InstallArea/python/AthenaCommon/AtlasUnixStandardJob.py", line 57, in _setupAtlasUnixStandardJob
              from StoreGate.StoreGateConf import StoreGateSvc
          ImportError: No module named StoreGateConf
          athena> 
          [ATN, test wrapper] minutes elapsed: 1 
         

  • Mon, 21 May 2007 04:59:35 +0200 13.0.X-VAL release rel_1 i686-slc4-gcc34-dbg. NICOS: suspicious pattern:"OK(ABSENSE OF)" !!! /afs/cern.ch/atlas/software/builds/nightlies/val/AtlasSimulation/rel_1/NICOS_TestLogVAL32BS4SimDbg/Simulation_G4Atlas_G4AtlasApps_G4AtlasApps_AtlasSim.loglog and(or) http://cern.ch/atlas-computing/links/distDirectory/nightlies/VALWebArea/nicos_web_areaVAL32BS4SimDbg/NICOS_TestLog_rel_1/Simulation_G4Atlas_G4AtlasApps_G4AtlasApps_AtlasSim.loglog
           *** Break *** segmentation violation
          [ATN, test wrapper] minutes elapsed: 2 
          [ATN, test wrapper] minutes elapsed: 3 
          Using host libthread_db library "/lib64/tls/libthread_db.so.1".
          Attaching to program: /proc/9097/exe, process 9097
          `shared object read from target memory' has disappeared; keeping its symbols.
    
          ...
    
          Traceback (most recent call last):
            File "/build/atnight/localbuilds/nightlies/val/AtlasCore/rel_0/InstallArea/share/bin/athena.py", line 400, in ?
              include( "AthenaCommon/runbatch.py" )
            File "/build/atnight/localbuilds/nightlies/val/AtlasCore/rel_0/InstallArea/python/AthenaCommon/Include.py", line 136, in __call__
          CORAL/Services/ConnectionService  Warning Failure while attempting to connect to "sqlite_file:sqlite200/ALLP200.db": CORAL/RelationalPlugins/sqlite ( CORAL : "Connection::connect" from "/build/atnight/localbuilds/nightlies/val/AtlasSimulation/rel_0/NICOS_area/NICOS_qmtestVAL32BS4SimDbg/g4atlasapps_atlassim_work/sqlite200/ is not writable" )
              execfile( name, __main__.__dict__, __main__.__dict__ )
            File "/build/atnight/localbuilds/nightlies/val/AtlasCore/rel_0/InstallArea/jobOptions/AthenaCommon/runbatch.py", line 11, in ?
              theApp.run()     # runs until theApp.EvtMax events reached
            File "/build/atnight/localbuilds/nightlies/val/AtlasCore/rel_0/InstallArea/python/AthenaCommon/AppMgr.py", line 392, in run
              sc = self.initialize()
            File "/build/atnight/localbuilds/nightlies/val/AtlasCore/rel_0/InstallArea/python/AthenaCommon/AppMgr.py", line 360, in initialize
              sc = super( AthAppMgr, self ).initialize()
            File "/afs/cern.ch/atlas/offline/external/GAUDI/v19r2p4/GaudiPython/python/gaudimodule.py", line 187, in initialize
              return self._isvc.initialize()
          SystemError: problem in C++; program state has been reset
          athena> 
          
           *** Break *** segmentation violation
          ApplicationMgr      FATAL finalize: Invalid state "Configured"
          ApplicationMgr       INFO Application Manager Terminated successfully
          Py:Athena            INFO leaving with code 32: "exception raised during initialization"
          [ATN, test wrapper] minutes elapsed: 5 
          Using host libthread_db library "/lib64/tls/libthread_db.so.1".
          Attaching to program: /proc/9097/exe, process 9097
          `shared object read from target memory' has disappeared; keeping its symbols.
          [Thread debugging using libthread_db enabled]
          
          warning: Unable to set global thread event mask: generic error
          Error while reading shared library symbols:
          Cannot find new threads: generic error
          0xffffe410 in __kernel_vsyscall ()
          Quitting: ptrace: No such process.
           -------------------------------- 
           FAILURE (ERROR) : test jobOptions.G4Atlas_Sim.py
           -------------------------------- 
          [ATN, test wrapper] minutes elapsed: 6 
          [ATN, test wrapper] completion of test process is detected
         

  • rel_0,1,2 (05/13-5)
           *** Break *** segmentation violation
          `shared object read from target memory' has disappeared; keeping its symbols.
           *** Break *** segmentation violation
          ApplicationMgr      FATAL finalize: Invalid state "Configured"
         
  • rel_6 (05/12)
          Error in <TUnixSystem::DynamicPathName>: libG4AtlasControlDict[.so | .sl | .dl | .a | .dll] does not exist in .:/afs/cern.ch/sw/lcg/external/root/5...
          Unexpected error: ('Error Loading dictionary', None, <traceback object at 0xf4e01b44>) 
          
           ROOT5 migration problem:  G4AtlasControlDict
          AttributeError: class _global_cpp has no attribute 'SimControl'    
          ApplicationMgr      FATAL finalize: Invalid state "Configured"
        

TestPileUp#TestPileUp
2007-Jun-04 rel_1 13.0.X, i686-slc4-gcc34-opt #BF32BS4SimOpt Segmentation fault (invalid memory reference) CORAL/Services/ConnectionService
  • 2007-Jun-04 rel_1
          CORAL/Services/ConnectionService     Info Loading default plugin for coral::IRelationalService: CORAL/Services/RelationalService
          CORAL/Services/RelationalService     Info Found plugin for RDBMS technology "frontier" with native implementation
        ...
          CORAL/Services/RelationalService     Info Default implementation for RDBMS technology "sqlite" is native
          FATAL 2007-Jun-04 10:35:30 [static void ers::ErrorHandler::SignalHandler::action(int, siginfo_t*, void*) at ers/src/ErrorHandler.cxx:88] Got signal 11 Segmentation fault (invalid memory reference)
        

G4FastSimulation
06/01 04:40 rel_5 #VAL32BS3SimOpt
05/31 05:48 rel_4 #BF32BS3SimOpt
05/30 06:09 rel_3 #VAL32BS3SimOpt
05/27 05:13 rel_0 #VAL32BS3SimOpt
05/23 09:59 rel_3 #BF32BS3SimDbg
05/23 09:36 rel_3 #BF32BS3SimOpt
05/21 07:05 rel_1 #BF32BS3SimDbg

CaloSimEx_TestConfiguration
  • 05/30/2007 rel_3 13.0.X, i686-slc4-gcc34-opt http://atlas-computing.web.cern.ch/atlas-computing/links/distDirectory/nightlies/BFWebArea/nicos_web_areaBF32BS4SimOpt/NICOS_TestLog_rel_3/Calorimeter_CaloExample_CaloSimEx_CaloSimEx_TestConfiguration.loglog
          CORAL/Services/RelationalService     Info Default implementation for RDBMS technology "sqlite" is native
          
           *** Break *** segmentation violation
          CORAL/Services/ConnectionService     Info Loading default plugin for coral::IAuthenticationService: CORAL/Services/XMLAuthenticationService
          Using host libthread_db library "/lib64/tls/libthread_db.so.1".
          Attaching to program: /proc/7362/exe, process 7362
          `shared object read from target memory' has disappeared; keeping its symbols.
          [Thread debugging using libthread_db enabled]     
         ...
          Thread 2 (Thread 3991432096 (LWP 13244)):
         ...
          #14 0x00b84f90 in _dl_runtime_resolve () from /lib/ld-linux.so.2
          #15 0xee615b5c in coral::ConnectionService::ConnectionPool::cleanUpTimedOutConnections ()
         ...
          Thread 1 (Thread 4159637184 (LWP 7362)):
         ...
          #7  0xffff58d8 in ?? ()
          #8  0xf4f12ff1 in boost::mutex::do_lock ()
             from /afs/cern.ch/atlas/offline/external/LCGCMT/LCGCMT_51/InstallArea/i686-slc4-gcc34-opt/lib/libboost_thread-gcc-mt.so
          #9  0xf4f12ff1 in boost::mutex::do_lock ()
             from /afs/cern.ch/atlas/offline/external/LCGCMT/LCGCMT_51/InstallArea/i686-slc4-gcc34-opt/lib/libboost_thread-gcc-mt.so
          #10 0xee611e92 in coral::ConnectionService::ConnectionPool::getSessionFromConnectionPool ()
         ...
            File "/afs/cern.ch/atlas/offline/external/GAUDI/v19r2p4/GaudiPython/python/gaudimodule.py", line 187, in initialize
              return self._isvc.initialize()
          SystemError: problem in C++; program state has been reset
          athena> 
          ApplicationMgr                            FATAL finalize: Invalid state "Configured"
          ApplicationMgr                             INFO Application Manager Terminated successfully
          Py:Athena            INFO leaving with code 32: "exception raised during initialization"
          [ATN, test wrapper] minutes elapsed: 1 
          [ATN, test wrapper] completion of test process is detected
         

CaloDigEx_TestConfiguration
  • failed with BF32BS4SimOpt (5/15 - 5/17)
  • keeps failing with BF32BS3SimDbg
  • 05/26/2007 rel_6 13.0.X, i686-slc4-gcc34-opt http://atlas-computing.web.cern.ch/atlas-computing/links/distDirectory/nightlies/BFWebArea/nicos_web_areaBF32BS4SimOpt/NICOS_TestLog_rel_6/Calorimeter_CaloExample_CaloDigEx_CaloDigEx_TestConfiguration.loglog
          rfio:/castor/cern.ch/user/k/kbernard/RTT/mc11.004100.T1_McAtNLO_top.simul.HITS.v11000301._00001.pool.root   Always Root file version:40402
          WARNING: $POOL_CATALOG is not defined
          using default `xmlcatalog_file:PoolFileCatalog.xml'
          [ATN, test wrapper] minutes elapsed: 1 
          /build/atnight/localbuilds/nightlies/projects/AtlasSimulation/rel_0/Calorimeter/CaloExample/CaloDigEx/test/CaloDigEx_TestConfiguration.sh: line 17:   945 Segmentation fault      athena.py CaloDigEx/CaloDigEx.py >&${LOGFILE}
           -------------------------------- 
           FAILURE (ERROR) : test CaloDigEx 
           -------------------------------- 
          #######################################
          ############ LOG FILE #################
          #######################################
         ...
          CORAL/Services/RelationalService     Info Default implementation for RDBMS technology "sqlite" is native
          
           *** Break *** segmentation violation
          Using host libthread_db library "/lib64/tls/libthread_db.so.1".
          Attaching to program: /proc/945/exe, process 945
          `shared object read from target memory' has disappeared; keeping its symbols.
          [Thread debugging using libthread_db enabled]
         ...
          Thread 2 (Thread 3993111456 (LWP 15565)):
         ...
          #14 0x00b84f90 in _dl_runtime_resolve () from /lib/ld-linux.so.2
          #15 0xeee04a45 in coral::ConnectionService::ConnectionPoolTimer::operator() ()
         ...
          Thread 1 (Thread 4159637184 (LWP 945)):
         ...
          #11 0xf509de43 in seal::SharedLibrary::load ()
         ...
          #17 0xf501fd36 in seal::ComponentLoader::load ()
             from /afs/cern.ch/atlas/offline/external/LCGCMT/LCGCMT_51/InstallArea/i686-slc4-gcc34-opt/lib/liblcg_SealKernel.so
          #18 0xed611237 in coral::RelationalService::RelationalService::domain ()
         ....
          #38 0CORAL/Services/ConnectionService     Info Loading default plugin for coral::IAuthenticationService: CORAL/Services/XMLAuthenticationService
          CORAL/Services/ConnectionService  Warning Failure while attempting to connect to "sqlite_file:sqlite200/ALLP200.db": CORAL/RelationalPlugins/sqlite ( CORAL : "Connection::connect" from "/build/atnight/localbuilds/nightlies/projects/AtlasSimulation/rel_0/NICOS_area/NICOS_qmtestBF32BS4SimOpt/calodigex_testconfiguration_work/sqlite200/ is not writable" )
          xf5a74d37 in (anonymous namespace)::method_3555 ()
             from /afs/cern.ch/atlas/offline/external/GAUDI/v19r2p4/InstallArea/i686-slc4-gcc34-opt/lib/libGaudiKernelDict.so
          #39 0xf63aa1c4 in ROOT::Cintex::Method_stub_with_context ()
             from /afs/cern.ch/sw/lcg/external/root/5.14.00e/slc4_ia32_gcc34/root/lib/libCintex.so
          #40 0x0997c1de in ?? ()
          #41 0x0997b910 in ?? ()
          #42 0x0a1ba794 in ?? ()
          #43 0x00000000 in ?? ()
          CORAL/Services/ConnectionService     Info  Connection to service "ATLAS_COOLPROD" established. Id=7c756c44-0b60-11dc-98c7-000423d59b7a
          CORAL/Services/ConnectionService     Info New session on connection to service "ATLAS_COOLPROD" started for user "ATLAS_COOL_READER". Connection Id=7c756c44-0b60-11dc-98c7-000423d59b7a
          RalSessionMgr     Info Start a read-only transaction active for the duration of the database connection
          RelationalDatabase     Info Instantiate a R/O RalDatabase for 'COOL_LAR/OFLP200'
          [ATN, test wrapper] minutes elapsed: 2 
          [ATN, test wrapper] completion of test process is detected
         


Known issues
Known issues

AtlasSimulationRelease#PROJECT_UNIT_TEST
keeps failing.
  • According to Manuel, the same error occurs everywhere, and no need to worry here.
          checkPlugins exit status 1
          FAILURE (ERROR): output of 'cmt show cycles -private':     
          GaudiSvc 
          FAILURE (ERROR): checkPlugins.py: checkPlugins exit status 1
          


Old issues
Old issues
MuonHitTest
  • now ok
  • build failed on 05/15 (rel_2) - 05/16 (rel_3)


Daily info
Daily info

  • problem with the nightlies: please check out Control/AthenaServices
From: "David Quarrie" <David.Quarrie@cern.ch>
To: hn-atlas-SWDevelopersAnnounce@cern.ch
Date: Thu, 31 May 2007 10:20:43 +0200

I've patched 13.0.X and 13.0.X-VAL rel_4 on AFS with this new version.

        David
On 31 May 2007, at 03:42, Paolo Calafiura wrote:

>
> *** Discussion title: Software Developers Announcements
>
> Hi everyone,
> if you want to work with tomorrow's nightlies please check out
> cmt co -r AthenaServices-01-12-07 Control/AthenaServices
> and build the package. This will give you a functional athena.
>  Notice that the upcoming 13.0.10 won't suffer from this problem
> thanks to a fix from Emil applied while building the release.
>
>  Apologies for the screw-up...
>     Paolo
https://hypernews.cern.ch/HyperNews/Atlas/get/SWDevelopersAnnounce/180/1.html

2007/05/22 rel_2

2007/05/21 rel_1

2007/05/19 rel_6

2007/05/15 rel_2

  • 13.0.X, i686-slc3-gcc323-opt: No build



Summary Tables

#ATN
  06/05 rel_2   06/04 rel_1   06/03 rel_0   06/02 rel_6   06/01 rel_5   05/31 rel_4   05/30 rel_3   05/29 rel_2   05/28 rel_1   05/27 rel_0   05/26 rel_6   05/25 rel_5   05/24 rel_4   05/23 rel_3   05/22 rel_2 >>   05/21 rel_1 >>   05/20 rel_0   05/19 rel_6 >>   05/18 rel_5   05/17 rel_4   05/16 rel_3   05/15 rel_2 >>   05/14   05/13   05/12   05/11   05/10   05/09  
Failed Builds Test Success(%) RTT Tests Failed Builds Test Success(%) RTT Tests
13.0.X BF32BS4SimDbg
<!-- 06/05 rel_2 -->
0
N/A  
<!-- 06/04 rel_1 -->
0
N/A  
<!-- 06/03 rel_0 -->
1
N/A  
<!-- 06/02 rel_6 -->
0
N/A  
<!-- 06/01 rel_5 -->
0
N/A  
<!-- 05/31 rel_4 -->
0
N/A  
<!-- 05/30 rel_3 -->
0
N/A  
<!-- 05/29 rel_2 -->
0
N/A  
<!-- 05/28 rel_1 -->
0
N/A  
<!-- 05/27 rel_0 -->
0
N/A  
<!-- 05/26 rel_6 -->
0
N/A  
<!-- 05/25 rel_5 -->
0
N/A  
<!-- 05/24 rel_4 -->
0
N/A  
<!-- 05/23 rel_3 -->
0
N/A  
<!-- 05/22 rel_2 -->
0
N/A  
<!-- 05/21 rel_1 -->
0
N/A  
<!-- 05/20 rel_0 -->
0
N/A  
<!-- 05/19 rel_6 -->
0
N/A  
<!--05/18 rel_5-->
0
N/A  
<!--05/17 rel_4-->
0
N/A  
<!--05/16-->
0
N/A  
<!--05/15-->
0
N/A  
<!--05/14-->
0
N/A  
<!--05/13-->
0
N/A  
<!--05/12-->
0
N/A  
<!--05/11-->
0
N/A  
<!--05/10-->
0
N/A  
<!--05/09-->
0
N/A    
BF32BS4SimOpt
<!-- bugfix i686-slc4-gcc34-opt -->
<!-- 06/05 rel_2 -->
0
50  
<!-- 06/04 rel_1 -->
0
50 16/8/0, 3/0/0
<!-- 06/03 rel_0 -->
1
83 16/8/0, 3/0/0
<!-- 06/02 rel_6 -->
0
66 16/8/0, 3/0/0
<!-- 06/01 rel_5 -->
0
83 x
<!-- 05/31 rel_4 -->
0
0 16/8/0, 3/0/0
<!-- 05/30 rel_3 -->
0
66 16/8/0, 3/0/0
<!-- 05/29 rel_2 -->
0
66 16/8/0, 3/1/0
<!-- 05/28 rel_1 -->
0
83 x,
<!-- 05/27 rel_0 -->
0
83 x,
<!-- 05/26 rel_6 -->
0
50 15/8/0, 3/0/0
<!-- 05/25 rel_5 -->
0
83 15/10/0, 3/0/0
<!-- 05/24 rel_4 -->
0
66 15/7/0, 1/1/0
<!-- 05/23 rel_3 -->
0
83 15/8/0, 1/1/0
<!-- 05/22 rel_2 -->
0
50 15/6/0, 1/1/0
<!-- 05/21 rel_1 -->
0
83 15/5/0, 1/1/0
<!-- 05/20 rel_0 -->
0
66 15/5/0
<!-- 05/19 rel_6 -->
0
83 15/8/0
<!--05/18 rel_5-->
0
66 15/8/0
<!--05/17 rel_4-->
0
66 x
<!--05/16 rel_3-->
0
50 x
<!--05/15 rel_2-->
0
50 15/8/0
<!--05/14 rel_1-->
0
66 15/10/0
<!--05/13 rel_0-->
0
66 15/8/0
<!--05/12 rel_6-->
1
16 15/0/0
<!--05/11 rel_5-->
0
66 15/9/0
<!--05/10 rel_4-->
0
83 15/8/0
<!--05/09 rel_3-->
0
83 15/7/0  
BF32BS3SimDbg
<!-- 06/05 rel_2 -->
   
<!-- 06/04 rel_1 -->
   
<!-- 06/03 rel_0 -->
   
<!-- 06/02 rel_6 -->
   
<!-- 06/01 rel_5 -->
   
<!-- 05/31 rel_4 -->
   
<!-- 05/30 rel_3 -->
x
   
<!-- 05/29 rel_2 -->
x
   
<!-- 05/28 rel_1 -->
x
   
<!-- 05/27 rel_0 -->
x
   
<!-- 05/26 rel_6 -->
x
   
<!-- 05/25 rel_5 -->
0
0  
<!-- 05/24 rel_4 -->
0
16  
<!-- 05/23 rel_3 -->
1
0  
<!-- 05/22 rel_2 -->
88
0  
<!-- 05/21 rel_1 -->
2
66  
<!-- 05/20 rel_0 -->
93
0  
<!-- 05/19 rel_6 -->
0
50  
<!-- 05/18 rel_5 -->
0
66  
<!-- 05/17 rel_4 -->
0
50  
<!--05/16-->
0
66  
<!--05/15-->
x
x  
<!--05/14-->
1
50  
<!--05/13-->
0
66  
<!--05/12-->
4
66  
<!--05/11-->
3
50  
<!--05/10-->
4
16  
<!--05/09-->
4
50    
BF32BS3SimOpt
<!-- bugfix i686-slc3-gcc323-opt -->
<!-- 06/05 rel_2 -->
0
66  
<!-- 06/04 rel_1 -->
0
50  
<!-- 06/03 rel_0 -->
0
66  
<!-- 06/02 rel_6 -->
0
66  
<!-- 06/01 rel_5 -->
0
83  
<!-- 05/31 rel_4 -->
1
66  
<!-- 05/30 rel_3 -->
0
83  
<!-- 05/29 rel_2 -->
0
66 16/11/0, 3/0/0
<!-- 05/28 rel_1 -->
0
66 x
<!-- 05/27 rel_0 -->
0
83 x
<!-- 05/26 rel_6 -->
0
83 16/11/5/0, 3/1/0
<!-- 05/25 rel_5 -->
0
33 15/0/0, 3/1/0
<!-- 05/24 rel_4 -->
0
33 15/0/0, 1/1/0
<!-- 05/23 rel_3 -->
1
33 15/0/0, 1/1/0
<!-- 05/22 rel_2 -->
x
x x, x
<!-- 05/21 rel_1 -->
0
83 15/8/0, 1/1/0
<!-- 05/20 rel_0 -->
93
0 x
<!-- 05/19 rel_6 -->
0
83 15/8/0
<!-- 05/18 rel_5 -->
0
83 15/7/0
<!-- 05/17 rel_4 -->
0
83 x
<!-- 05/16 rel_3 -->
0
83 x
<!-- 05/15 rel_2 -->
x
N/A 15/0/0
<!-- 05/14 rel_1 -->
1
83 15/10/0
<!-- 05/13 rel_0 -->
0
83 15/9/0
<!-- 05/12 rel_6 -->
0
83 15/9/0
<!-- 05/11 rel_5 -->
0
83 15/8/0
<!-- 05/10 rel_4 -->
1
50 15/1/0
<!-- 05/09 rel_3 -->
2
66 15/9/0  
BF64BS4SimDbg
<!-- 06/05 rel_2 -->
10
50  
<!-- 06/04 rel_1 -->
10
66  
<!-- 06/03 rel_0 -->
10
0  
<!-- 06/02 rel_6 -->
10
33  
<!-- 06/01 rel_5 -->
10
66  
<!-- 05/31 rel_4 -->
10
0  
<!-- 05/30 rel_3 -->
10
66  
<!-- 05/29 rel_2 -->
10
66  
<!-- 05/28 rel_1 -->
10
50  
<!-- 05/27 rel_0 -->
10
16  
<!-- 05/26 rel_6 -->
10
33  
<!-- 05/25 rel_5 -->
10
50  
<!-- 05/24 rel_4 -->
10
66  
<!-- 05/23 rel_3 -->
10
66  
<!-- 05/22 rel_2 -->
10
0  
<!-- 05/21 rel_1 -->
10
0  
<!-- 05/20 rel_0 -->
10
16  
<!-- 05/19 rel_6 -->
10
16  
<!-- 05/18 rel_5 -->
10
33  
<!-- 05/17 rel_4 -->
10
16  
<!--05/16-->
10
33  
<!--05/15-->
10
0  
<!--05/14-->
10
16  
<!--05/13-->
10
66  
<!--05/12-->
10
50  
<!--05/11-->
10
50  
<!--05/10-->
10
50  
<!--05/09-->
10
66    
BF64BS4SimOpt
<!-- 06/05 rel_2 -->
10
83  
<!-- 06/04 rel_1 -->
10
50  
<!-- 06/03 rel_0 -->
x
   
<!-- 06/02 rel_6 -->
x
   
<!-- 06/01 rel_5 -->
x
   
<!-- 05/31 rel_4 -->
10
0  
<!-- 05/30 rel_3 -->
10
66  
<!-- 05/29 rel_2 -->
10
83  
<!-- 05/28 rel_1 -->
10
66  
<!-- 05/27 rel_0 -->
10
83  
<!-- 05/26 rel_6 -->
10
66  
<!-- 05/25 rel_5 -->
10
66  
<!-- 05/24 rel_4 -->
10
66  
<!-- 05/23 rel_3 -->
10
66  
<!-- 05/22 rel_2 -->
10
33  
<!-- 05/21 rel_1 -->
10
0  
<!-- 05/20 rel_0 -->
10
33  
<!-- 05/19 rel_6 -->
10
33  
<!-- 05/18 rel_5 -->
11
16  
<!-- 05/17 rel_4 -->
10
33  
<!--05/16-->
10
0  
<!--05/15-->
10
0  
<!--05/14-->
10
83  
<!--05/13-->
10
66  
<!--05/12-->
10
83  
<!--05/11-->
10
83  
<!--05/10-->
10
66  
<!--05/09-->
10
50    
13.0.X-VAL VAL32BS4SimDbg
<!-- val i686-slc4-gcc34-dbg -->
<!-- 06/05 rel_2 -->
0
16  
<!-- 06/04 rel_1 -->
0
16  
<!-- 06/03 rel_0 -->
0
16  
<!-- 06/02 rel_6 -->
0
33  
<!-- 06/01 rel_5 -->
0
16  
<!-- 05/31 rel_4 -->
0
0  
<!-- 05/30 rel_3 -->
0
16 16/9/0, 3/1/0
<!-- 05/29 rel_2 -->
0
33 16/7/0, 3/0/0
<!-- 05/28 rel_1 -->
0
16 x
<!-- 05/27 rel_0 -->
0
16 x
<!-- 05/26 rel_6 -->
0
16 16/15/7/0, 3/0/0
<!-- 05/25 rel_5 -->
0
33 16/8/0, 3/0/0
<!-- 05/24 rel_4 -->
0
0 15/7/0, 1/1/1
<!-- 05/23 rel_3 -->
0
16 15/9/0
<!-- 05/22 rel_2 -->
0
33 15/4/0, 1/1/0
<!-- 05/21 rel_1 -->
0
33 15/13/0, 1/1/0
<!-- 05/20 rel_0 -->
0
50 15/8/0
<!-- 05/19 rel_6 -->
0
50 x
<!-- 05/18 rel_5 -->
0
66 15/8/0
<!-- 05/17 rel_4 -->
0
50 x
<!--05/16-->
1
33 x
<!--05/15-->
1
50 15/12/0
<!--05/14-->
0
33 15/7/0
<!--05/13-->
0
50 15/9/0
<!--05/12-->
0
83  
<!--05/11-->
0
50 15/8/0
<!--05/10-->
0
50 15/10/0  
VAL32BS4SimOpt
<!-- val i686-slc4-gcc34-opt -->
<!-- 06/05 rel_2 -->
0
50  
<!-- 06/04 rel_1 -->
0
33 16/7/0, 3/0/0
<!-- 06/03 rel_0 -->
0
50 16/7/0, 3/0/0
<!-- 06/02 rel_6 -->
0
16 16/7/0, 3/0/0
<!-- 06/01 rel_5 -->
0
50 16/10/0, 3/0/0
<!-- 05/31 rel_4 -->
0
0 16/14/9/0, 3/0/0
<!-- 05/30 rel_3 -->
0
50  
<!-- 05/29 rel_2 -->
0
66  
<!-- 05/28 rel_1 -->
0
33  
<!-- 05/27 rel_0 -->
0
33  
<!-- 05/26 rel_6 -->
0
50  
<!-- 05/25 rel_5 -->
0
50  
<!-- 05/24 rel_4 -->
0
50  
<!-- 05/23 rel_3 -->
0
50  
<!-- 05/22 rel_2 -->
0
66  
<!-- 05/21 rel_1 -->
0
66  
<!-- 05/20 rel_0 -->
0
66  
<!-- 05/19 rel_6 -->
0
33  
<!-- 05/18 rel_5 -->
0
66  
<!-- 05/17 rel_4 -->
0
66  
<!--05/16-->
1
66  
<!--05/15-->
1
16  
<!--05/14-->
0
50  
<!--05/13-->
0
33  
<!--05/12-->
0
83  
<!--05/11-->
0
50  
<!--05/10-->
0
66    
VAL32BS3SimOpt
<!-- 06/05 rel_2 -->
0
0  
<!-- 06/04 rel_1 -->
2
0  
<!-- 06/03 rel_0 -->
1
0  
<!-- 06/02 rel_6 -->
0
0  
<!-- 06/01 rel_5 -->
1
0  
<!-- 05/31 rel_4 -->
0
0  
<!-- 05/30 rel_3 -->
1
0  
<!-- 05/29 rel_2 -->
0
0  
<!-- 05/28 rel_1 -->
0
16  
<!-- 05/27 rel_0 -->
1
0  
<!-- 05/26 rel_6 -->
0
0    
VAL64BS4SimOpt
<!-- 06/05 rel_2 -->
10
N/A  
<!-- 06/04 rel_1 -->
10
N/A  
<!-- 06/03 rel_0 -->
10
N/A  
<!-- 06/02 rel_6 -->
10
N/A  
<!-- 06/01 rel_5 -->
10
N/A  
<!-- 05/31 rel_4 -->
10
N/A  
<!-- 05/30 rel_3 -->
10
N/A  
<!-- 05/29 rel_2 -->
10
N/A  
<!-- 05/28 rel_1 -->
10
N/A  
<!-- 05/27 rel_0 -->
10
N/A  
<!-- 05/26 rel_6 -->
10
N/A  
<!-- 05/25 rel_5 -->
10
N/A    
13.X.0 Dev32BS4SimDbg
<!-- 06/05 rel_2 -->
0
N/A  
<!-- 06/04 rel_1 -->
0
N/A  
<!-- 06/03 rel_0 -->
0
N/A  
<!-- 06/02 rel_6 -->
0
N/A  
<!-- 06/01 rel_5 -->
0
N/A  
<!-- 05/31 rel_4 -->
1
N/A  
<!-- 05/30 rel_3 -->
0
N/A  
<!-- 05/29 rel_2 -->
0
N/A  
<!-- 05/28 rel_1 -->
0
N/A  
<!-- 05/27 rel_0 -->
0
N/A  
<!-- 05/26 rel_6 -->
0
N/A  
<!-- 05/25 rel_5 -->
0
N/A  
<!-- 05/24 rel_4 -->
0
N/A  
<!-- 05/23 rel_3 -->
0
N/A  
<!-- 05/22 rel_2 -->
0
N/A  
<!-- 05/21 rel_1 -->
92
N/A  
<!-- 05/20 rel_0 -->
0
N/A  
<!-- 05/19 rel_6 -->
0
N/A  
<!-- 05/18 rel_5 -->
0
N/A  
<!-- 05/17 rel_4 -->
0
N/A  
<!--05/16-->
1
N/A  
<!--05/15-->
1
N/A  
<!--05/14-->
0
N/A  
<!--05/13-->
0
N/A  
<!--05/12-->
0
N/A  
<!--05/11-->
0
N/A  
<!--05/10-->
1
N/A  
<!--05/09-->
2
N/A    
Dev32BS4SimOpt
<!-- dev i686-slc4-gcc34-opt -->
<!-- 06/05 rel_2 -->
0
33  
<!-- 06/04 rel_1 -->
0
16 16/0/0, 3/0/0
<!-- 06/03 rel_0 -->
0
16 16/0/0, 3/1/0
<!-- 06/02 rel_6 -->
0
16 16/0/0, 3/1/0
<!-- 06/01 rel_5 -->
0
50 x
<!-- 05/31 rel_4 -->
0
0 16/0/0, 3/1/0
<!-- 05/30 rel_3 -->
0
16 16/1/0, 3/1/0
<!-- 05/29 rel_2 -->
0
16 16/1/0, 3/1/0
<!-- 05/28 rel_1 -->
0
16  
<!-- 05/27 rel_0 -->
0
16  
<!-- 05/26 rel_6 -->
0
16  
<!-- 05/25 rel_5 -->
0
16  
<!-- 05/24 rel_4 -->
0
16  
<!-- 05/23 rel_3 -->
0
66  
<!-- 05/22 rel_2 -->
0
50  
<!-- 05/21 rel_1 -->
92
0
<!-- 05/20 rel_0 -->
0
66  
<!-- 05/19 rel_6 -->
0
66  
<!-- 05/18 rel_5 -->
0
66  
<!-- 05/17 rel_4 -->
0
66  
<!--05/16-->
1
66  
<!--05/15-->
1
50  
<!--05/14-->
0
66  
<!--05/13-->
0
66  
<!--05/12-->
0
N/A  
<!--05/11-->
0
66  
<!--05/10-->
1
0  
<!--05/09-->
3
33    
Dev64BS4SimDbg
<!-- 06/05 rel_2 -->
1
33  
<!-- 06/04 rel_1 -->
1
16  
<!-- 06/03 rel_0 -->
1
16  
<!-- 06/02 rel_6 -->
1
16  
<!-- 06/01 rel_5 -->
1
16  
<!-- 05/31 rel_4 -->
1
0  
<!-- 05/30 rel_3 -->
0
0  
<!-- 05/29 rel_2 -->
0
0  
<!-- 05/28 rel_1 -->
0
0  
<!-- 05/27 rel_0 -->
0
0  
<!-- 05/26 rel_6 -->
0
x  
<!-- 05/25 rel_5 -->
0
0  
<!-- 05/24 rel_4 -->
0
16  
<!-- 05/23 rel_3 -->
0
66  
<!-- 05/22 rel_2 -->
0
66  
<!-- 05/21 rel_1 -->
92
0  
<!-- 05/20 rel_0 -->
0
50  
<!-- 05/19 rel_6 -->
0
50  
<!-- 05/18 rel_5 -->
0
50  
<!-- 05/17 rel_4 -->
0
16  
<!--05/16-->
1
16  
<!--05/15-->
2
0  
<!--05/14-->
0
0  
<!--05/13-->
0
0  
<!--05/12-->
0
0  
<!--05/11-->
   
<!--05/10-->
1
0  
<!--05/09-->
3
0    
Dev64BS4SimOpt
<!-- 06/05 rel_2 -->
1
16  
<!-- 06/04 rel_1 -->
1
16  
<!-- 06/03 rel_0 -->
1
16  
<!-- 06/02 rel_6 -->
1
16  
<!-- 06/01 rel_5 -->
1
16  
<!-- 05/31 rel_4 -->
1
0  
<!-- 05/30 rel_3 -->
0
16  
<!-- 05/29 rel_2 -->
0
16  
<!-- 05/28 rel_1 -->
0
16  
<!-- 05/27 rel_0 -->
0
16  
<!-- 05/26 rel_6 -->
0
0  
<!-- 05/25 rel_5 -->
0
16  
<!-- 05/24 rel_4 -->
0
16  
<!-- 05/23 rel_3 -->
0
50  
<!-- 05/22 rel_2 -->
0
33  
<!-- 05/21 rel_1 -->
92
0  
<!-- 05/20 rel_0 -->
0
33  
<!-- 05/19 rel_6 -->
0
50  
<!-- 05/18 rel_5 -->
0
50  
<!-- 05/17 rel_4 -->
0
0  
<!--05/16-->
1
0  
<!--05/15-->
2
0  
<!--05/14-->
0
0  
<!--05/13-->
3
0  
<!--05/12-->
0
0  
<!--05/11-->
0
0  
<!--05/10-->
1
0  
<!--05/09-->
2
0    
13.0.X-LCG LCG32BS4SimDbg
<!-- 06/05 rel_2 -->
125
N/A  
<!-- 06/04 rel_1 -->
x
   
<!-- 06/03 rel_0 -->
93
0  
<!-- 06/02 rel_6 -->
93
0  
<!-- 06/01 rel_5 -->
93
0  
<!-- 05/31 rel_4 -->
125
N/A  
<!-- 05/30 rel_3 -->
93
0  
<!-- 05/29 rel_2 -->
7
0  
<!-- 05/28 rel_1 -->
7
0  
<!-- 05/27 rel_0 -->
7
0  
<!-- 05/26 rel_6 -->
93
0  
<!-- 05/25 rel_5 -->
92
0  
<!-- 05/24 rel_4 -->
92
0  
<!-- 05/23 rel_3 -->
92
0  
<!-- 05/22 rel_2 -->
0
0  
<!-- 05/21 rel_1 -->
0
0  
<!-- 05/20 rel_0 -->
0
0  
<!-- 05/19 rel_6 -->
0
0  
<!-- 05/18 rel_5 -->
0
0  
<!-- 05/17 rel_4 -->
0
0  
<!--05/16-->
0
0  
<!--05/15-->
0
0  
<!--05/14-->
0
0  
<!--05/13-->
0
0  
<!--05/12-->
0
0  
<!--05/11-->
0
33  
<!--05/10-->
0
0  
<!--05/09-->
0
0    
2.0.5-COS COS32BS3SimOpt
<!-- 06/05 rel_2 -->
   
<!-- 06/04 rel_1 -->
   
<!-- 06/03 rel_0 -->
   
<!-- 06/02 rel_6 -->
0
66  
<!-- 06/01 rel_5 -->
   
<!-- 05/31 rel_4 -->
0
66  
<!-- 05/30 rel_3 -->
   
<!-- 05/29 rel_2 -->
0
50  
<!-- 05/28 rel_1 -->
   
<!-- 05/27 rel_0 -->
   
<!-- 05/26 rel_6 -->
3
16  
<!-- 05/25 rel_5 -->
   
<!-- 05/24 rel_4 -->
3
16  
<!-- 05/23 rel_3 -->
   
<!-- 05/22 rel_2 -->
13
0  
<!-- 05/21 rel_1 -->
   
<!-- 05/20 rel_0 -->
   
<!-- 05/19 rel_6 -->
13
0  
<!-- 05/18 rel_5 -->
   
<!-- 05/17 rel_4 -->
3
16  
<!--05/16-->
15
33  
<!--05/15-->
15
0  
<!--05/14-->
   
<!--05/13-->
   
<!--05/12-->
0
33  
<!--05/11-->
0
33    
2.0.X BF120X32BS3SimOpt
<!-- 06/05 rel_2 -->
0
83  
<!-- 06/04 rel_1 -->
0
66  
<!-- 06/03 rel_0 -->
0
66  
<!-- 06/02 rel_6 -->
0
83  
<!-- 06/01 rel_5 -->
0
66  
<!-- 05/31 rel_4 -->
0
66  
<!-- 05/30 rel_3 -->
0
66  
<!-- 05/29 rel_2 -->
0
66  
<!-- 05/28 rel_1 -->
0
50  
<!-- 05/27 rel_0 -->
0
66  
<!-- 05/26 rel_6 -->
65
0    


#ATN #AtnSummaryTables i686-slc4-gcc34-dbg http://cern.ch/atlas-computing/links/distDirectory/nightlies/projects/nicos_web_areaBF32BS4SimDbg/

release name status date copy status Failed Builds Test Success(%)
rel_2 done 06/05 05:29 done 0 N/A
rel_1 done 06/04 05:46 done 0 N/A
rel_0 done 06/03 05:33 done 1 N/A build: Photos_i
rel_6 done 06/02 05:34 done 0 N/A
rel_5 done 06/01 05:07 done 0 N/A
rel_4 done 05/31 05:32 done 0 N/A
rel_3 done 05/30 05:27 done 0 N/A
rel_2 done 05/29 05:24 done 0 N/A
rel_1 done 05/28 05:22 done 0 N/A
rel_0 done 05/27 05:21 done 0 N/A
rel_6 done 05/26 05:28 done 0 N/A
rel_5 done 05/25 05:21 done 0 N/A
rel_4 done 05/24 05:25 done 0 N/A
rel_3 done 05/23 05:19 done 0 N/A
rel_2 done 05/22 05:09 done 0 N/A
rel_1 done 05/21 13:36 done 0 N/A
rel_0 done 05/20 05:04 done 0 N/A
rel_6 done 05/19 05:17 done 0 N/A
rel_5 done 05/18 05:16 done 0 N/A
rel_4 done 05/17 05:21 done 0 N/A
rel_3 done 05/16 05:11 done 0 N/A
rel_2 done 05/15 04:54 done 0 N/A
rel_1 done 05/14 05:03 done 0 N/A
rel_0 done 05/13 04:49 done 0 N/A
rel_6 done 05/12 05:02 done 0 N/A
rel_5 done 05/11 05:05 done 0 N/A
rel_4 done 05/10 05:20 done 0 N/A
rel_3 done 05/09 05:03 done 0 N/A

#ATN #AtnSummaryTables i686-slc4-gcc34-opt http://cern.ch/atlas-computing/links/distDirectory/nightlies/BFWebArea/nicos_web_areaBF32BS4SimOpt/

release name status date copy status Failed Builds Test Success(%)
rel_2 done 06/05 11:01 done 0 50 test: CaloSimEx_TestConfiguration(segm.viol.coral), G4AtlasApps_AtlasSim(segm.viol.coral)
rel_1 done 06/04 10:53 done 0 50 test: TestPileUp#TestPileUp(seg.fault.coral), G4AtlasApps_AtlasSim(seg.vio.coral)
rel_0 done 06/03 10:42 done 0 83
rel_6 done 06/02 10:37 done 0 66 test: G4AtlasApps_AtlasSim(seg.vio.coral)
rel_5 done 06/01 09:06 done 0 83
rel_4 done 05/31 10:49 done 0 0
rel_3 done 05/30 10:38 done 0 66 test: + CaloSimEx_TestConfiguration (gaudimodule.py)
rel_2 done 05/29 10:26 done 0 66 test: + G4AtlasApps_AtlasSim (gaudimodule.py)
rel_1 done 05/28 10:50 done 0 83
rel_0 done 05/27 10:09 done 0 83
rel_6 done 05/26 10:29 done 0 50 test: + CaloDigEx_TestConfiguration (>>), G4AtlasApps_AtlasSim (gaudimodule.py)
rel_5 done 05/25 11:08 done 0 83 test: AtlasSimulationRelease#PROJECT_UNIT_TEST
rel_4 done 05/24 10:47 done 0 66 test: + G4AtlasApps_AtlasSim
rel_3 done 05/23 10:47 done 0 83
rel_2 done 05/22 23:00 done 0 50 #AtnNote20070522
rel_1 done 05/21 20:16 done 0 83
rel_0 done 05/20 10:16 done 0 66 test: G4AtlasApps_AtlasSim, AtlasSimulationRelease#PROJECT_UNIT_TEST
rel_6 done 05/19 11:06 done 0 83 test: AtlasSimulationRelease#PROJECT_UNIT_TEST
rel_5 done 05/18 10:32 done 0 66 test: TestPileUp#TestPileUp, AtlasSimulationRelease#PROJECT_UNIT_TEST
rel_4 done 05/17 10:37 done 0 66 test: CaloDigEx_TestConfiguration, AtlasSimulationRelease#PROJECT_UNIT_TEST
rel_3 done 05/16 10:32 done 0 50 test: CaloDigEx_TestConfiguration, G4AtlasApps_AtlasSim, AtlasSimulationRelease#PROJECT_UNIT_TEST
rel_2 done 05/15 09:58 done 0 50 test: CaloDigEx_TestConfiguration, G4AtlasApps_AtlasSim, AtlasSimulationRelease#PROJECT_UNIT_TEST
rel_1 done 05/14 09:49 done 0 66 test: G4AtlasApps_AtlasSim, AtlasSimulationRelease#PROJECT_UNIT_TEST
rel_0 done 05/13 09:24 done 0 66 test: G4AtlasApps_AtlasSim, AtlasSimulationRelease#PROJECT_UNIT_TEST
rel_6 done 05/12 09:22 done 1 16 build: G4AtlasControl, test: CaloSimEx_TestConfiguration, TestPileUp#TestPileUp, G4AtlasApps_AtlasSim, AtlasSimulationRelease#PROJECT_UNIT_TEST, CTB_G4Sim
rel_5 done 05/11 09:59 done 0 66 test: TestPileUp#TestPileUp, AtlasSimulationRelease#PROJECT_UNIT_TEST
rel_4 done 05/10 10:06 done 0 83 test: AtlasSimulationRelease#PROJECT_UNIT_TEST
rel_3 done 05/09 09:34 done 0 83 test: AtlasSimulationRelease#PROJECT_UNIT_TEST

#ATN #AtnSummaryTables http://cern.ch/atlas-computing/links/distDirectory/nightlies/projects/nicos_web_areaBF32BS3SimDbg/

release name status date copy status Failed Builds Test Success(%)
rel_1 nightly started 06/04 02:25 N/A 2 66
rel_0 nightly started 06/03 02:25 N/A 93 0
rel_6 nightly started 06/02 02:25 N/A 0 50
rel_5 nightly started 06/01 02:25 N/A
rel_4 nightly started 05/31 02:24 N/A
rel_5 done 05/25 12:10 done 0 0
rel_4 done 05/24 08:56 done 0 16
rel_3 done 05/23 09:59 done 1 0 build: G4FastSimulation rel_2 nightly started 05/22 02:25 N/A 88 0 #AtnNote20070522
rel_1 done 05/21 07:05 done ; tests pending 2 66 build: G4FastSimulation, LArG4FastSimulation #AtnNote20070521
rel_0 done 05/20 14:03 done 93 0
rel_6 done 05/19 10:23 done 0 50 test: + CaloSimEx_TestConfiguration
rel_5 done 05/18 13:07 done 0 66
rel_4 done 05/17 13:35 done 0 50 test: + CaloSimEx_TestConfiguration
rel_3 done 05/16 13:26 done 0 66 test: CaloDigEx_TestConfiguration, AtlasSimulationRelease#PROJECT_UNIT_TEST
rel_2 done 05/15 11:50 done 88 0
rel_1 done 05/14 11:54 done 1 50 build: Pythia_i; test: CaloDigEx_TestConfiguration, CaloSimEx_TestConfiguration, AtlasSimulationRelease#PROJECT_UNIT_TEST
rel_0 done 05/13 15:29 done 0 66 test:!CaloDigEx_TestConfiguration, AtlasSimulationRelease#PROJECT_UNIT_TEST
rel_6 done 05/12 08:06 done 4 66 build: LArG4FastSimulation, Pyquench_i, PythiaB, Pythia_i; test: CaloSimEx_TestConfiguration, AtlasSimulationRelease#PROJECT_UNIT_TEST
rel_5 done 05/11 10:57 done 3 50 build: Pyquench_i, PythiaB, Pythia_i; test: CaloDigEx_TestConfiguration, CaloSimEx_TestConfiguration, AtlasSimulationRelease#PROJECT_UNIT_TEST
rel_4 done 05/10 05:59 done 4 16 build: Pyquench_i, PythiaB, Pythia_i, TRT_TR_Process; test: CaloDigEx_TestConfiguration, CaloSimEx_TestConfiguration, G4AtlasApps_AtlasSim, AtlasSimulationRelease#PROJECT_UNIT_TEST, CTB_G4Sim
rel_3 done 05/09 05:31 done 4 50 build: LArG4FastSimulation, Pyquench_i, PythiaB, Pythia_i; test: CaloDigEx_TestConfiguration, CaloSimEx_TestConfiguration, AtlasSimulationRelease#PROJECT_UNIT_TEST

#ATN #AtnSummaryTables i686-slc3-gcc323-opt http://cern.ch/atlas-computing/links/distDirectory/nightlies/projects/nicos_web_areaBF32BS3SimOpt/

release name status date copy status Failed Builds Test Success(%)
rel_2 done 06/05 06:12 done 0 66 test: G4AtlasApps_AtlasSim(killed as time quota spent: 15 min)
rel_1 done 06/04 05:56 done 0 50
rel_0 done 06/03 17:16 done 0 66
rel_6 done 06/02 05:36 done 0 66
rel_5 done 06/01 05:22 done 0 83
rel_4 done 05/31 05:48 done 1 66 build: G4FastSimulation, test: CaloSimEx_TestConfiguration
rel_3 done 05/30 07:19 done 0 83
rel_2 done 05/29 05:22 done 0 66
rel_1 done 05/28 06:42 done 0 66 test: + G4AtlasApps_AtlasSim
rel_0 done 05/27 17:43 done 0 83
rel_6 done 05/26 12:56 done 0 83 test: AtlasSimulationRelease#PROJECT_UNIT_TEST
rel_5 done 05/25 11:46 done 0 33
rel_4 done 05/24 08:32 done 0 33
>>|
rel_3 done 05/23 09:36 done 1 33 build: G4FastSimulation
>>|
rel_2 nightly started 05/22 02:28 N/A 0 N/A #AtnNote20070522
rel_1 done 05/21 06:32 done ; tests pending 0 83 #AtnNote20070521
rel_0 done 05/20 14:42 done 93 0
rel_6 done 05/19 10:05 done 0 83
rel_5 done 05/18 13:29 done 0 83
rel_4 done 05/17 13:51 done 0 83
rel_3 done 05/16 13:38 done 0 83 test: AtlasSimulationRelease#PROJECT_UNIT_TEST
rel_2 done 05/15 12:12 done 0 N/A
rel_1 done 05/14 12:14 done 1 83 build: Pythia_i
rel_0 done 05/13 16:07 done 0 83
rel_6 done 05/12 07:47 done 0 83
rel_5 done 05/11 10:50 done 0 83 test: AtlasSimulationRelease#PROJECT_UNIT_TEST
rel_4 done 05/10 05:19 done 1 50 build: TRT_G4_SD, test: G4AtlasApps_AtlasSim, AtlasSimulationRelease#PROJECT_UNIT_TEST, CTB_G4Sim
rel_3 done 05/09 05:06 done 2 66 build: EventBoost, LArG4FastSimulation, test: CaloDigEx_TestConfiguration, AtlasSimulationRelease#PROJECT_UNIT_TEST

#ATN #AtnSummaryTables x86_64-slc4-gcc34-dbg http://cern.ch/atlas-computing/links/distDirectory/nightlies/BFWebArea/nicos_web_areaBF64BS4SimDbg

release name status date copy status Failed Builds Test Success(%)
rel_2 done 06/05 06:34 done 10 50 test: CaloSimEx_TestConfiguration, G4AtlasApps_AtlasSim(killed as time quota spent: 15min)
rel_1 done 06/04 22:02 done 10 66
rel_0 done 06/03 04:59 done 10 0
rel_6 done 06/02 06:13 done 10 33
rel_5 done 06/01 05:18 done 10 66 build: 10 Generators, test: CaloDigEx_TestConfiguration, AtlasSimulationRelease#PROJECT_UNIT_TEST
rel_4 done 05/31 05:45 done 10 0
rel_3 done 05/30 05:30 done 10 66 test: CaloDigEx_TestConfiguration, AtlasSimulationRelease#PROJECT_UNIT_TEST
rel_2 done 05/29 06:25 done 10 66 test: CaloDigEx_TestConfiguration, AtlasSimulationRelease#PROJECT_UNIT_TEST
rel_1 done 05/28 05:46 done 10 50
rel_0 done 05/27 05:57 done 10 16
rel_6 done 05/26 06:03 done 10 33
rel_5 done 05/25 05:39 done 10 50 test: + CaloDigEx_TestConfiguration
rel_4 done 05/24 05:21 done 10 66 test: G4AtlasApps_AtlasSim, AtlasSimulationRelease#PROJECT_UNIT_TEST
rel_3 done 05/23 05:27 done 10 66 test: CaloDigEx_TestConfiguration, AtlasSimulationRelease#PROJECT_UNIT_TEST
rel_2 nightly started 05/22 00:20 N/A 10 0 #AtnNote20070522
rel_1 done 05/21 13:21 done 10 0 #AtnNote20070521
rel_0 done 05/20 05:21 done 10 16
rel_6 done 05/19 05:24 done 10 16
rel_5 done 05/18 05:00 done 10 33
rel_4 done 05/17 04:54 done 10 16
rel_3 done 05/16 04:36 done 10 33 build: 10 Generators, test: CaloDigEx_TestConfiguration, CaloSimEx_TestConfiguration, TestPileUp#TestPileUp, AtlasSimulationRelease#PROJECT_UNIT_TEST
rel_2 done 05/15 04:20 done 10 0
rel_1 done 05/14 05:13 done 10 16
rel_0 done 05/13 04:51 done 10 66
rel_6 done 05/12 04:58 done 10 50
rel_5 done 05/11 04:53 done 10 50
rel_4 done 05/10 04:45 done 10 50
rel_3 done 05/09 04:37 done 10 66

#ATN #AtnSummaryTables x86_64-slc4-gcc34-opt http://cern.ch/atlas-computing/links/distDirectory/nightlies/projects/nicos_web_areaBF64BS4SimOpt/

release name status date copy status Failed Builds Test Success(%)
rel_2 done 06/05 05:02 done 10 83
rel_1 done 06/04 05:08 done 10 50
|rel_4 |done |05/31 04:47 |done |10 |0 |build: 10 Generators
rel_3 done 05/30 04:49 done 10 66
rel_2 done 05/29 05:01 done 10 83
rel_1 done 05/28 04:41 done 10 66
rel_0 done 05/27 04:50 done 10 83
rel_6 done 05/26 04:45 done 10 66
rel_5 done 05/25 04:49 done 10 66 test: G4AtlasApps_AtlasSim, AtlasSimulationRelease#PROJECT_UNIT_TEST
rel_4 done 05/24 05:02 done 10 66 test: CaloDigEx_TestConfiguration, AtlasSimulationRelease#PROJECT_UNIT_TEST
rel_3 done 05/23 04:35 done 10 66 test: AtlasSimulationRelease#PROJECT_UNIT_TEST, CTB_G4Sim
rel_2 done 05/22 18:11 done 10 33
rel_1 done 05/21 12:34 done 10 0 #AtnNote20070521
rel_0 done 05/20 04:32 done 10 33
rel_6 done 05/19 05:12 done 10 33
rel_5 done 05/18 04:28 done 11 16 build: 11 Generators
rel_4 done 05/17 04:23 done 10 33 build: 10 Generators
rel_3 done 05/16 04:31 done 10 0 build: 10 Generators
rel_2 done 05/15 04:01 done 10 0
rel_1 done 05/14 04:35 done 10 83
rel_0 done 05/13 04:28 done 10 66
rel_6 done 05/12 04:31 done 10 83
rel_5 done 05/11 04:37 done 10 83
rel_4 done 05/10 04:36 done 10 66
rel_3 done 05/09 04:34 done 10 50

http://cern.ch/atlas-computing/links/distDirectory/nightlies/global/index13.0.X-VAL.html

#ATN #AtnSummaryTables i686-slc4-gcc34-dbg http://cern.ch/atlas-computing/links/distDirectory/nightlies/VALWebArea/nicos_web_areaVAL32BS4SimDbg/

release name status date copy status Failed Builds Test Success(%)
rel_2 done 06/05 06:26 done 0 16
rel_1 done 06/04 05:56 done 0 16
rel_0 done 06/03 05:48 done 0 16
rel_6 done 06/02 05:57 done 0 33
rel_5 done 06/01 06:01 done 0 16
rel_4 done 05/31 05:38 done 0 0
rel_3 done 05/30 06:02 done 0 16
rel_2 done 05/29 05:58 done 0 33
rel_1 done 05/28 06:09 done 0 16
rel_0 done 05/27 06:02 done 0 16
rel_6 done 05/26 06:07 done 0 16
rel_5 done 05/25 06:17 done 0 33 test: CaloSimEx_TestConfiguration, G4AtlasApps_AtlasSim, AtlasSimulationRelease#PROJECT_UNIT_TEST, CTB_G4Sim
rel_4 done 05/24 06:07 done 0 0
rel_3 done 05/23 05:51 done 0 16
rel_2 done 05/22 05:47 done 0 33
rel_1 done 05/21 14:20 done 0 33 test: + G4AtlasApps_AtlasSim #AtnNote20070521
rel_0 done 05/20 06:00 done 0 50
rel_6 done 05/19 05:28 done 0 50 test: + CaloDigEx_TestConfiguration
rel_5 done 05/18 14:03 done 0 66 test: - CaloDigEx_TestConfiguration
rel_4 done 05/17 05:59 done 0 50 test: CaloDigEx_TestConfiguration, CaloSimEx_TestConfiguration, AtlasSimulationRelease#PROJECT_UNIT_TEST
rel_3 done 05/16 05:49 done 1 33 build: MuonHitTest, test: CaloDigEx_TestConfiguration, CaloSimEx_TestConfiguration, TestPileUp#TestPileUp, AtlasSimulationRelease#PROJECT_UNIT_TEST
rel_2 done 05/15 05:21 done 1 50 build: MuonHitTest, test: CaloDigEx_TestConfiguration, AtlasSimulationRelease#PROJECT_UNIT_TEST, CTB_G4Sim #AtnNote20070521
rel_1 done 05/14 05:34 done 0 33 test: CaloDigEx_TestConfiguration, CaloSimEx_TestConfiguration, G4AtlasApps_AtlasSim, AtlasSimulationRelease#PROJECT_UNIT_TEST
rel_0 done 05/13 05:26 done 0 50 test: CaloDigEx_TestConfiguration, G4AtlasApps_AtlasSim, AtlasSimulationRelease#PROJECT_UNIT_TEST
rel_6 done 05/12 05:28 done 0 83 test: AtlasSimulationRelease#PROJECT_UNIT_TEST
rel_5 done 05/11 05:38 done 0 50 test: CaloDigEx_TestConfiguration, CaloSimEx_TestConfiguration, AtlasSimulationRelease#PROJECT_UNIT_TEST
rel_4 done 05/10 05:31 done 0 50 test: CaloSimEx_TestConfiguration, G4AtlasApps_AtlasSim, AtlasSimulationRelease#PROJECT_UNIT_TEST

#ATN #AtnSummaryTables i686-slc4-gcc34-opt http://cern.ch/atlas-computing/links/distDirectory/nightlies/VALWebArea/nicos_web_areaVAL32BS4SimOpt/

release name status date copy status Failed Builds Test Success(%)
rel_2 done 06/05 07:04 done 0 50
rel_1 done 06/04 06:35 done 0 33
rel_0 done 06/03 06:03 done 0 50
rel_6 done 06/02 06:45 done 0 16
rel_5 done 06/01 06:35 done 0 50
rel_4 done 05/31 06:29 done 0 0
rel_3 done 05/30 06:25 done 0 50
rel_2 done 05/29 06:33 done 0 66
rel_1 done 05/28 06:12 done 0 33
rel_0 done 05/27 06:34 done 0 33
rel_6 done 05/26 06:25 done 0 50
rel_5 done 05/25 06:45 done 0 50 test: G4AtlasApps_AtlasSim, AtlasSimulationRelease#PROJECT_UNIT_TEST, CTB_G4Sim
rel_4 done 05/24 06:54 done 0 50 test: G4AtlasApps_AtlasSim, AtlasSimulationRelease#PROJECT_UNIT_TEST, CTB_G4Sim
rel_3 done 05/23 06:33 done 0 50 test: CaloSimEx_TestConfiguration, G4AtlasApps_AtlasSim, AtlasSimulationRelease#PROJECT_UNIT_TEST
rel_2 done 05/22 19:05 done 0 66 #AtnNote20070522
rel_1 done 05/21 14:47 done 0 66 test: CaloDigEx_TestConfiguration, AtlasSimulationRelease#PROJECT_UNIT_TEST #AtnNote20070521
rel_0 done 05/20 06:16 done 0 66 test: G4AtlasApps_AtlasSim, AtlasSimulationRelease#PROJECT_UNIT_TEST
rel_6 done 05/19 06:41 done 0 33 test: CaloDigEx_TestConfiguration, CaloSimEx_TestConfiguration, TestPileUp#TestPileUp, AtlasSimulationRelease#PROJECT_UNIT_TEST
rel_5 done 05/18 14:16 done 0 66 test: CaloSimEx_TestConfiguration, AtlasSimulationRelease#PROJECT_UNIT_TEST
rel_4 done 05/17 06:27 done 0 66 test: CaloSimEx_TestConfiguration, AtlasSimulationRelease#PROJECT_UNIT_TEST
rel_3 done 05/16 06:24 done 1 66 build: MuonHitTest, test: CaloDigEx_TestConfiguration, AtlasSimulationRelease#PROJECT_UNIT_TEST
rel_2 done 05/15 06:15 done 1 16 build: MuonHitTest, test: CaloDigEx_TestConfiguration, CaloSimEx_TestConfiguration, G4AtlasApps_AtlasSim, AtlasSimulationRelease#PROJECT_UNIT_TEST, CTB_G4Sim
rel_1 done 05/14 06:16 done 0 50 test: CaloSimEx_TestConfiguration, G4AtlasApps_AtlasSim, AtlasSimulationRelease#PROJECT_UNIT_TEST
rel_0 done 05/13 05:56 done 0 33 test: CaloDigEx_TestConfiguration, CaloSimEx_TestConfiguration, G4AtlasApps_AtlasSim, AtlasSimulationRelease#PROJECT_UNIT_TEST
rel_6 done 05/12 07:02 done 0 83 test: AtlasSimulationRelease#PROJECT_UNIT_TEST
rel_5 done 05/11 05:59 done 0 50 test: CaloSimEx_TestConfiguration, G4AtlasApps_AtlasSim, AtlasSimulationRelease#PROJECT_UNIT_TEST
rel_4 done 05/10 06:25 done 0 66 test: CaloSimEx_TestConfiguration, AtlasSimulationRelease#PROJECT_UNIT_TEST

#ATN #AtnSummaryTables i686-slc3-gcc323-opt http://cern.ch/atlas-computing/links/distDirectory/nightlies/VALWebArea/nicos_web_areaVAL32BS3SimOpt

release name status date copy status Failed Builds Test Success(%)
rel_2 done 06/05 12:56 done 0 0
rel_1 done 06/04 04:46 done 2 0 build: G4FastSimulation, LArG4FastSimulation
rel_0 done 06/03 04:58 done 1 0 build: G4FastSimulation
rel_6 done 06/02 04:48 done 0 0
rel_5 done 06/01 04:40 done 1 0 build: G4FastSimulation
rel_4 done 05/31 04:59 done 0 0
rel_3 done 05/30 06:09 done 1 0 build: G4FastSimulation
rel_2 done 05/29 05:08 done 0 0
rel_1 done 05/28 04:49 done 0 16
rel_0 done 05/27 05:13 done 1 0 build: G4FastSimulation
rel_6 done 05/26 10:47 done 0 0
rel_5 nightly started 05/25 00:19 N/A

#ATN #AtnSummaryTables x86_64-slc4-gcc34-opt http://cern.ch/atlas-computing/links/distDirectory/nightlies/VALWebArea/nicos_web_areaVAL64BS4SimOpt

release name status date copy status Failed Builds Test Success(%)
rel_2 done 06/05 04:33 done 10 N/A
rel_1 done 06/04 03:44 done 10 N/A
rel_0 done 06/03 03:50 done 10 N/A
rel_6 done 06/02 04:14 done 10 N/A
rel_5 done 06/01 03:56 done 10 N/A
rel_4 done 05/31 04:28 done 10 N/A build: 10 Generators
rel_3 done 05/30 04:14 done 10 N/A
rel_2 done 05/29 03:49 done 10 N/A
rel_1 done 05/28 03:30 done 10 N/A
rel_0 done 05/27 03:42 done 10 N/A
rel_6 done 05/26 03:40 done 10 N/A
rel_5 done 05/25 04:10 done 10 N/A

http://cern.ch/atlas-computing/links/distDirectory/nightlies/global/index13.X.0.html

#ATN #AtnSummaryTables i686-slc4-gcc34-dbg http://cern.ch/atlas-computing/links/distDirectory/nightlies/projects/nicos_web_areaDev32BS4SimDbg/

release name status date copy status Failed Builds Test Success(%)
rel_2 done 06/05 05:21 done 0 N/A
rel_1 done 06/04 05:04 done 0 N/A
rel_0 done 06/03 05:18 done 0 N/A
rel_6 done 06/02 05:01 done 0 N/A
rel_5 done 06/01 04:43 done 0 N/A
rel_4 done 05/31 05:06 done 1 N/A build: Herwig_i
rel_3 done 05/30 05:05 done 0 N/A
rel_2 done 05/29 05:13 done 0 N/A
rel_1 done 05/28 05:00 done 0 N/A
rel_0 done 05/27 05:00 done 0 N/A
rel_6 done 05/26 05:34 done 0 N/A
rel_5 done 05/25 04:54 done 0 N/A
rel_4 done 05/24 05:05 done 0 N/A
rel_3 done 05/23 05:14 done 0 N/A
rel_2 done 05/22 16:00 done 0 N/A
rel_1 done 05/21 04:38 done 92 N/A
rel_0 done 05/20 05:02 done 0 N/A
rel_6 done 05/19 04:57 done 0 N/A
rel_5 done 05/18 04:50 done 0 N/A
rel_4 done 05/17 04:56 done 0 N/A
rel_3 done 05/16 04:49 done 1 N/A build: MuonHitTest
rel_2 done 05/15 04:21 done ; tests pending 1 N/A build: MuonHitTest
rel_1 done 05/14 05:03 done 0 N/A
rel_0 done 05/13 05:11 done 0 N/A
rel_6 done 05/12 04:27 done with errors 0 N/A
rel_5 done 05/11 05:09 done 0 N/A
rel_4 done 05/10 04:55 done 1 N/A build: Winhac_i
rel_3 done 05/09 04:25 done 2 N/A build: EvtGen_i, Winhac_i

#ATN #AtnSummaryTables i686-slc4-gcc34-opt

http://cern.ch/atlas-computing/links/distDirectory/nightlies/projects/nicos_web_areaDev32BS4SimOpt/
release name status date copy status Failed Builds Test Success(%)
rel_2 done 06/05 11:29 done 0 33
rel_1 done 06/04 10:29 done 0 16
rel_0 done 06/03 10:19 done 0 16
rel_6 done 06/02 10:34 done 0 16
rel_5 done 06/01 09:22 done 0 50
rel_4 done 05/31 10:40 done 0 0
rel_3 done 05/30 10:52 done 0 16
rel_2 done 05/29 11:16 done 0 16
rel_1 done 05/28 10:36 done 0 16
rel_0 done 05/27 10:52 done 0 16
rel_6 done 05/26 11:01 done 0 16
rel_5 done 05/25 11:06 done 0 16
rel_4 done 05/24 10:56 done 0 16
rel_3 done 05/23 11:11 done 0 66
rel_2 done 05/22 20:09 done 0 50 test: + CaloSimEx_TestConfiguration
rel_1 done 05/21 09:34 done 92 0
rel_0 done 05/20 07:37 done 0 66 test: CaloDigEx_TestConfiguration, AtlasSimulationRelease#PROJECT_UNIT_TEST
rel_6 done 05/19 10:57 done 0 66 test: CaloDigEx_TestConfiguration, AtlasSimulationRelease#PROJECT_UNIT_TEST
rel_5 done 05/18 10:36 done 0 66 test: CaloDigEx_TestConfiguration, AtlasSimulationRelease#PROJECT_UNIT_TEST
rel_4 done 05/17 11:01 done 0 66 test: CaloDigEx_TestConfiguration, AtlasSimulationRelease#PROJECT_UNIT_TEST
rel_3 done 05/16 10:32 done 1 66 build: MuonHitTest
rel_2 done 05/15 09:37 done ; tests pending 1 50 build: MuonHitTest
rel_1 done 05/14 10:22 done 0 66 test: CaloDigEx_TestConfiguration, AtlasSimulationRelease#PROJECT_UNIT_TEST
rel_0 done 05/13 09:54 done 0 66 test: CaloDigEx_TestConfiguration, AtlasSimulationRelease#PROJECT_UNIT_TEST
rel_6 make done, tests started 05/12 06:13 done with errors; tests pending 0 N/A
rel_5 done 05/11 09:52 done 0 66 test: CaloDigEx_TestConfiguration, AtlasSimulationRelease#PROJECT_UNIT_TEST
rel_4 done 05/10 09:35 done 1 0 build: Winhac_i
rel_3 done 05/02 09:51 done 3 33 build: ReadSherpa_i, SCT_Digitization, Sherpa_i; test: CaloDigEx_TestConfiguration, CaloSimEx_TestConfiguration, G4AtlasApps_AtlasSim, AtlasSimulationRelease#PROJECT_UNIT_TEST

#ATN #AtnSummaryTables x86_64-slc4-gcc34-dbg http://cern.ch/atlas-computing/links/distDirectory/nightlies/slc4/nicos_web_areaDev64BS4SimDbg/

release name status date_time copy status Failed Builds Test Success(%)
rel_2 done 06/05 03:49 done 1 33 build: Herwig_i
rel_1 done 06/04 03:29 done 1 16 build: Herwig_i
rel_0 done 06/03 03:36 done 1 16 build: Herwig_i
rel_6 done 06/02 03:54 done 1 16 build: Herwig_i
rel_5 done 06/01 03:54 done 1 16 build: Herwig_i
rel_4 done 05/31 03:39 done 1 0 build: Herwig_i
rel_3 done 05/30 04:01 done 0 0
rel_2 done 05/29 04:04 done 0 0
rel_1 done 05/28 04:07 done 0 0
rel_0 done 05/27 04:07 done 0 0
rel_6 done 05/26 03:43 done with errors! 0 0
rel_5 done 05/25 03:59 done 0 0
rel_4 done 05/24 04:06 done 0 16
rel_3 done 05/23 03:59 done 0 66
rel_2 done 05/22 15:36 done 0 66 test: CaloDigEx_TestConfiguration, AtlasSimulationRelease#PROJECT_UNIT_TEST
rel_1 done 05/21 03:21 done 92 0
rel_0 done 05/20 03:51 done 0 50 test: CaloDigEx_TestConfiguration, G4AtlasApps_AtlasSim, AtlasSimulationRelease#PROJECT_UNIT_TEST
rel_6 done 05/19 04:07 done with errors 0 50 test: CaloDigEx_TestConfiguration, G4AtlasApps_AtlasSim, AtlasSimulationRelease#PROJECT_UNIT_TEST
rel_5 done 05/18 04:01 done 0 50 test: CaloDigEx_TestConfiguration, G4AtlasApps_AtlasSim, AtlasSimulationRelease#PROJECT_UNIT_TEST
rel_4 done 05/17 03:49 done 0 16 test: CaloDigEx_TestConfiguration, CaloSimEx_TestConfiguration, TestPileUp#TestPileUp, G4AtlasApps_AtlasSim, AtlasSimulationRelease#PROJECT_UNIT_TEST
rel_3 done 05/16 03:21 done 1 16 build: MuonHitTest, test: CaloDigEx_TestConfiguration, CaloSimEx_TestConfiguration, TestPileUp#TestPileUp, G4AtlasApps_AtlasSim, AtlasSimulationRelease#PROJECT_UNIT_TEST
rel_2 done 05/15 03:18 done 2 0 build: MuonHitTest, Phojet_i
rel_1 done 05/14 03:11 done 0 0
rel_0 done 05/13 03:29 done 0 0
rel_6 done 05/12 03:19 done with errors 0 0
rel_5 nightly started 05/11 02:20 N/A 11 0
rel_4 done 05/10 03:20 done with errors 1 0 build: Winhac_i
rel_3 done 05/09 03:56 done 3 0 build: EvtGen_i, Pythia_i, Winhac_i

#ATN #AtnSummaryTables x86_64-slc4-gcc34-opt http://cern.ch/atlas-computing/links/distDirectory/nightlies/slc4/nicos_web_areaDev64BS4SimOpt/

release name status date copy status Failed Builds Test Success(%)
rel_2 done 06/05 03:41 done 1 16 build: Herwig_i
rel_1 done 06/04 03:44 done 1 16 build: Herwig_i
rel_0 done 06/03 03:43 done 1 16 build: Herwig_i
rel_6 done 06/02 03:57 done 1 16 build: Herwig_i
rel_5 done 06/01 03:50 done 1 16 build: Herwig_i
rel_4 done 05/31 03:39 done 1 0 build: Herwig_i
rel_3 done 05/30 04:04 done 0 16
rel_2 done 05/29 03:54 done 0 16
rel_1 done 05/28 03:55 done 0 16
rel_0 done 05/27 03:54 done 0 16
rel_6 done 05/26 03:50 done 0 0
rel_5 done 05/25 03:55 done 0 16
rel_4 done 05/24 04:09 done 0 16
rel_3 done 05/23 04:11 done 0 50
rel_2 done 05/22 15:24 done 0 33
rel_1 done 05/21 03:30 done 92 0
rel_0 done 05/20 03:46 done 0 33
rel_6 done 05/19 03:53 done 0 50
rel_5 done 05/18 03:49 done 0 50
rel_4 done 05/17 03:38 done 0 0
rel_3 done 05/16 03:23 done 1 0
rel_2 done 05/15 03:23 N/A 2 0
rel_1 done 05/14 03:17 done 0 0
rel_0 done 05/13 03:24 done 3 0
rel_6 done 05/12 03:23 done with errors 0 0
rel_5 done 05/11 03:28 done 0 0
rel_4 done 05/10 03:34 done with errors 1 0
rel_3 done 05/09 03:55 done 2 0

http://cern.ch/atlas-computing/links/distDirectory/nightlies/global/index13.0.X-LCG.html

#ATN #AtnSummaryTables i686-slc4-gcc34-dbg http://cern.ch/atlas-computing/links/distDirectory/nightlies/projects/nicos_web_areaLCG32BS4SimDbg/

release name status date copy status Failed Builds Test Success(%)
rel_2 done 06/05 12:16 done 125 N/A
rel_1 configuration in progress 06/04 10:50 N/A
rel_0 done 06/03 15:34 done 93 0
rel_6 done 06/02 15:31 done 93 0
rel_5 done 06/01 15:11 done 93 0
rel_4 done 05/31 11:54 done 125 N/A
rel_3 done 05/30 15:26 done 93 0
rel_2 done 05/29 22:17 done 7 0
rel_1 done 05/28 22:18 done 7 0
rel_0 done 05/27 22:04 done 7 0
rel_6 done 05/26 15:43 done 93 0
rel_5 done 05/25 15:39 done 92 0
rel_4 done 05/24 21:12 done 92 0
rel_3 done 05/23 21:16 done 92 0
rel_2 done 05/22 22:14 done 0 0
rel_1 done 05/21 22:03 done 0 0
rel_0 done 05/20 21:51 done 0 0
rel_6 done 05/19 21:52 done 0 0
rel_5 done 05/18 22:11 done 0 0
rel_4 done 05/17 22:20 done 0 0
rel_3 done 05/16 22:21 done 0 0
rel_2 done 05/15 21:51 done 0 0
rel_1 done 05/14 21:58 done 0 0
rel_0 done 05/13 21:21 done 0 0
rel_6 done 05/12 21:29 done 0 0
rel_5 done 05/11 22:11 done 0 33
rel_4 done 05/10 21:48 done 0 0
rel_3 done 05/09 21:47 done 0 0

http://cern.ch/atlas-computing/links/distDirectory/nightlies/global/index2.0.5-COS.html

#ATN #AtnSummaryTables http://cern.ch/atlas-computing/links/distDirectory/nightlies/projects/nicos_web_areaCOS32BS3SimOpt

release name status date copy status Failed Builds Test Success(%)
rel_6 done 06/02 17:49 done 0 66
rel_4 done 05/31 17:32 done 0 66
rel_2 done 05/29 17:22 done 0 50
rel_6 done 05/26 17:12 done 3 16
rel_4 done 05/24 17:16 done 3 16 build: PixelDigitization, SCT_Digitization, TRT_Digitization
rel_2 done 05/22 15:24 done 13 0
rel_6 done 05/19 15:27 done 13 0
rel_4 done 05/17 17:22 done 3 16 build: PixelDigitization, SCT_Digitization, TRT_Digitization
rel_2 done 05/16 16:54 done 15 33
rel_2 done 05/15 12:10 done 15 0
rel_6 done 05/12 17:24 done 0 33 test: CaloDigEx_TestConfiguration, G4AtlasApps_AtlasSim, AtlasSimulationRelease#PROJECT_UNIT_TEST, CTB_G4Sim
rel_4 done 05/11 08:22 done 0 33 test: CaloDigEx_TestConfiguration, G4AtlasApps_AtlasSim, AtlasSimulationRelease#PROJECT_UNIT_TEST, CTB_G4Sim

http://cern.ch/atlas-computing/links/distDirectory/nightlies/global/index2.0.X.html

#ATN #AtnSummaryTables i686-slc3-gcc323-opt http://cern.ch/atlas-computing/links/distDirectory/nightlies/projects/nicos_web_areaBF120X32BS3SimOpt

release name status date copy status Failed Builds Test Success(%)
rel_2 done 06/05 03:02 done 0 83
rel_1 done 06/04 02:33 done 0 66
rel_0 done 06/03 02:58 done 0 66
rel_6 done 06/02 02:32 done 0 83
rel_5 done 06/01 02:26 done 0 66 test: CaloDigEx_TestConfiguration
rel_4 done 05/31 02:47 done 0 66 test: CaloDigEx_TestConfiguration
rel_3 done 05/30 02:40 done 0 66 test: CaloDigEx_TestConfiguration
rel_2 done 05/29 15:33 done 0 66 test: CaloDigEx_TestConfiguration
rel_1 done 05/28 15:41 done 0 50 test: CaloDigEx_TestConfiguration, TestPileUp#TestPileUp
rel_0 done 05/27 16:45 done 0 66 test: CaloDigEx_TestConfiguration
rel_6 done 05/26 00:59 done 65 0

http://cern.ch/atlas-computing/links/distDirectory/nightlies/global/indexKit_13.0.X.html

#ATN

release name status date copy status Failed Builds Test Success(%)

http://cern.ch/atlas-computing/links/distDirectory/nightlies/global/indexKit_13.X.0.html

#ATN

release name status date copy status Failed Builds Test Success(%)

#ATN #AtnSummaryTables

http://cern.ch/atlas-computing/links/distDirectory/nightlies/projects/nicos_web_areaMIG32BS4SimDbg/
release name status date copy status Failed Builds Test Success(%)
rel_1 done 04/24 04:10 done with errors; tests pending 2 N/A

#ATN #AtnSummaryTables

http://cern.ch/atlas-computing/links/distDirectory/nightlies/projects/nicos_web_areaMIG032BS4SimDbg/
release name status date copy status Failed Builds Test Success(%)
rel_1 done 05/14 15:13 done 0 N/A
rel_0 done 05/13 14:49 done 2 N/A
rel_2 done 05/12 14:48 done 2 N/A


Nightly Platform Latest Build Copy Test Date Failed Blds Test OK(%) NICOS Suffix
13.0.X
i686-slc3-gcc323-dbg
rel_0 done done done 04/22 10:20 0 83 BF32BS3SimDbg
Failed Builds: 0
Failed unit test: 1
AtlasSimulationRelease
FAILURE (ERROR): output of 'cmt show cycles -private':
GaudiSvc
1 tests total
1 (100%) tests PASS
rel_4 done done done 04/19 14:23 6 50 BF32BS3SimDbg
i686-slc3-gcc323-opt
rel_0 done done done 04/22 10:11 0 83 BF32BS3SimOpt
Failed Builds: 0
Failed unit test: 1
AtlasSimulationRelease
FAILURE (ERROR): output of 'cmt show cycles -private':
GaudiSvc
1 tests total
1 (100%) tests PASS
rel_4 done done done 04/19 14:52 8 66 BF32BS3SimOpt
i686-slc4-gcc34-dbg
rel_1 done done done 04/23 04:42 2 N/A BF32BS4SimDbg
Failed Builds: 2
ReadSherpa_i, Sherpa_i
Failed unit test: (no tests)
rel_5 done done done 04/20 04:28 3 N/A BF32BS4SimDbg
i686-slc4-gcc34-opt
rel_1 done done done 04/23 08:52 2 66 BF32BS4SimOpt
Failed Builds: 2
ReadSherpa_i, Sherpa_i
Failed Integration test:
Simulation_G4Atlas_G4AtlasApps
[ATN, test wrapper] test killed as time quota spent, test warning is issued
/afs/cern.ch/atlas/software/dist/nightlies/atn_12/atn_comm_wrapper.sh: line 40: 20402 Killed
1 tests total
1 (100%) tests PASS
Failed unit test:
AtlasSimulationRelease
FAILURE (ERROR): output of 'cmt show cycles -private':
GaudiSvc
1 tests total
1 (100%) tests PASS
rel_5 done done done 04/20 08:40 3 50 BF32BS4SimOpt
x86_64-slc4-gcc34-dbg
rel_1 done done done 04/23 04:21 10 66 BF64BS4SimDbg
Failed Builds: 10 Generators
Failed Integration test:
Calorimeter_CaloExample_CaloDigEx
[ATN, test wrapper] test killed as time quota spent, test warning is issued
/afs/cern.ch/atlas/software/dist/nightlies/atn_12/atn_comm_wrapper.sh: line 40: 8455 Killed
Failed unit test:
AtlasSimulationRelease
rel_3 done done* done 04/18 04:15 16 50 BF64BS4SimDbg
x86_64-slc4-gcc34-opt
rel_5 done done done 04/20 04:22 13 66 BF64BS4SimOpt
Failed Builds: 13
12 Generators + 1 External (Sherpa)
Failed Integration test:
Simulation_Digitization TestPileUp#TestPileUp
DllClassManager ERROR Could not load module InDetRawUtils
Failed unit test:
AtlasSimulationRelease
rel_5 done done done 04/20 04:22 13 66 BF64BS4SimOpt
13.X.0
i686-slc4-gcc34-dbg
rel_1 done done done 04/23 04:19 2 N/A Dev32BS4SimDbg
Failed Builds: 2
ReadSherpa_i, Sherpa_i
Failed tests: (no tests)
rel_5 done done done 04/20 04:23 2 N/A Dev32BS4SimDbg
x86_64-slc4-gcc34-dbg
rel_1 done done done 04/23 03:35 10 50 Dev64BS4SimDbg
Failed Builds: Generators
Failed tests
Calorimeter_CaloExample_CaloDigEx
CaloTriggerTowerService ERROR no LArTTCellMap from DetectorStore
Simulation_G4Atlas_G4AtlasApps
GeoModelSvc.Til... ERROR Could not get CaloCell_ID helper!
GeoModelSvc.Til... ERROR Cannot initialize IdDict helpers
GeoModelSvc ERROR Unable to create detector TileDetectorTool
GeoModelSvc FATAL Unable to build the detector geometry!
ServiceManager ERROR Unable to initialize Service: GeoModelSvc
ApplicationMgr FATAL finalize: Invalid state "Configured"
AtlasSimulationRelease
rel_3 done done* done 04/18 03:38 16 50 Dev64BS4SimDbg
x86_64-slc4-gcc34-opt
rel_1 done done done 04/23 03:28 10 50 Dev64BS4SimOpt
Failed Builds: Generators
Failed tests:
Calorimeter_CaloExample_CaloDigEx
CaloTriggerTowerService ERROR no LArTTCellMap from DetectorStore
AtlasSimulationRelease
Simulation_G4Sim_CTB_G4Sim
FAILURE (ERROR): output of 'cmt show cycles -private':
GaudiSvc
rel_5 done done done 04/20 03:36 10 50 Dev64BS4SimOpt
i686-slc4-gcc34-opt
rel_1 done done done 04/23 09:07 2 66 Dev32BS4SimOpt
Failed Builds: Generators
Failed tests:
Calorimeter_CaloExample_CaloDigEx
AtlasSimulationRelease
rel_5 done done done 04/20 08:42 2 33 Dev32BS4SimOpt
13.0.X-LCG i686-slc4-gcc34-dbg
rel_0 done done done 04/22 22:30 2 50 LCG32BS4SimDbg
rel_4 done done done 04/19 21:38 6 33 LCG32BS4SimDbg
13.0.X-MIG i686-slc4-gcc34-dbg
rel_0 done done done 04/23 04:10 2 N/A MIG32BS4SimDbg
rel_0 done done done 04/19 04:08 10 N/A MIG32BS4SimDbg
13.0.X-MIG0 i686-slc4-gcc34-dbg
rel_1 done done done 04/22 16:29 2 N/A MIG032BS4SimDbg
rel_0 done done done 04/19 16:07 6 N/A MIG032BS4SimDbg
13.0.X-VAL i686-slc4-gcc34-dbg
rel_1 done done done 04/23 05:18 2 50 VAL32BS4SimDbg
rel_4 done done done 04/19 05:13 6 33 VAL32BS4SimDbg

RTT


Todo
  • run tests interactively
  • monitor cpu/memory

General info


Daily issues

2007/05/30

2007/05/29

2007/05/22 rel_2

  • #AtnNote20070522

2007/05/20 rel_0

  • bugfix i686-slc4-gcc34-opt
    • Disk space problems that affected 2 CaloRecEx jobs (and prevented correct RTT close down)
  • bugfix i686-slc3-gcc323-opt
    • DQ reported on HyperNews that the build was corrupt.
  • val i686-slc4-gcc34-dbg
    • 1 G4AtlasApps job timed out (stange batch system response)

2007/05/19 rel_6

  • bugfix i686-slc4-gcc34-opt
    • 3 jobs timed out (CaloRecEx, Digitization, MboyPerformance).
  • bugfix i686-slc3-gcc323-opt
    • Many jobs timed out: please ignore run.
  • val i686-slc4-gcc34-dbg
    • DQ reported on HyperNews that the build was corrupt.

2007/05/18 rel_5

2007/05/17 rel_4

  • Disk space filled up: run should be ignored.

2007/05/16 rel_3

  • Disk space filled up: many jobs affected.

2007/05/15 rel_2

  • bugfix i686-slc3-gcc323-opt: Extra Info: Massive failure: ApplicationMgr WARNING Failed to load modules: AthenaServices
  • val i686-slc4-gcc34-dbg: Extra Info: 10 jobs timed out: batch system replied in an RTT unexpected manner.
  • everything failed in rel_2/bugfix/build run --- i686-slc3-gcc323-opt --- : G4AtlasApps
    • The release is not built or copied properly. http://cern.ch/atlas-computing/links/distDirectory/nightlies/projects/nicos_web_areaBF32BS3SimOpt/nicos_buildsummary_2.html http://cern.ch/atlas-computing/links/distDirectory/nightlies/BFWebArea/nicos_web_areaBF32BS3CoreOpt/nicos_buildsummary_2.html
              Error in <TUnixSystem::DynamicPathName>: libAthenaServicesDict[.so | .sl | .dl | .a | .dll] does not exist in .:/afs/cern.ch ...
              Traceback (most recent call last):
                File "/afs/cern.ch/atlas/software/builds/nightlies/bugfix/AtlasCore/rel_2/InstallArea/share/bin/athena.py", line 306, in ?
                  pylcgdict.loadDictionary( "AthenaServicesDict" )
                File "/afs/cern.ch/atlas/offline/external/Gaudi/v19r2p3/GaudiPython/python/gaudimodule.py", line 14, in _loadDict
                  return _loadDict_save(name)
                File "/afs/cern.ch/sw/lcg/external/root/5.14.00e/slc3_ia32_gcc323/root/lib/PyCintex.py", line 59, in loadDictionary
                  if sc == -1 : raise "Error Loading dictionary" 
              Error Loading dictionary
              
      from /afs/cern.ch/atlas/project/RTT/Work/rel_2/bugfix/build/i686-slc3-gcc323-opt/G4AtlasApps/AthenaG4AtlasApps/test_ATLAS_Template/456/45095.err /afs/cern.ch/atlas/project/RTT/Work/rel_2/bugfix/build/i686-slc3-gcc323-opt/G4AtlasApps/AthenaG4AtlasApps/test_ATLAS_Template/458/45125.err /afs/cern.ch/atlas/project/RTT/Work/rel_2/bugfix/build/i686-slc3-gcc323-opt/G4AtlasApps/AthenaG4AtlasApps/test_ATLAS_Template/460/45183.err(/afs/cern.ch/atlas/project/RTT/Work/rel_2/bugfix/build/i686-slc3-gcc323-opt/PyJobTransformsRTT/JobTransform/EvGen.5224.AlpgenJimmyWenuNp3/323/LSFJOB_45183/STDERR) /afs/cern.ch/atlas/project/RTT/Work/rel_2/bugfix/build/i686-slc3-gcc323-opt/G4AtlasApps/AthenaG4AtlasApps/test_ATLAS_Template/462/45255.err(/afs/cern.ch/atlas/project/RTT/Work/rel_2/bugfix/build/i686-slc3-gcc323-opt/PyJobTransformsRTT/JobTransform/EvGen.5224.AlpgenJimmyWenuNp3/323/LSFJOB_45255/STDERR) /afs/cern.ch/atlas/project/RTT/Work/rel_2/bugfix/build/i686-slc3-gcc323-opt/G4AtlasApps/AthenaG4AtlasApps/test_ATLAS_Template/464/45277.err(/afs/cern.ch/atlas/project/RTT/Work/rel_2/bugfix/build/i686-slc3-gcc323-opt/PyJobTransformsRTT/JobTransform/EvGen.5224.AlpgenJimmyWenuNp3/323/LSFJOB_45277/STDERR) /afs/cern.ch/atlas/project/RTT/Work/rel_2/bugfix/build/i686-slc3-gcc323-opt/G4AtlasApps/AthenaG4AtlasApps/test_ATLAS_Template/466/45350.err(/afs/cern.ch/atlas/project/RTT/Work/rel_2/bugfix/build/i686-slc3-gcc323-opt/PyJobTransformsRTT/JobTransform/EvGen.5224.AlpgenJimmyWenuNp3/323/LSFJOB_45350/STDERR) /afs/cern.ch/atlas/project/RTT/Work/rel_2/bugfix/build/i686-slc3-gcc323-opt/G4AtlasApps/AthenaG4AtlasApps/test_ATLAS_Template/468/45378.err(/afs/cern.ch/atlas/project/RTT/Work/rel_2/bugfix/build/i686-slc3-gcc323-opt/PyJobTransformsRTT/JobTransform/FullChain.7218.singlepart_mu20/320/LSFJOB_45378/STDERR) /afs/cern.ch/atlas/project/RTT/Work/rel_2/bugfix/build/i686-slc3-gcc323-opt/G4AtlasApps/AthenaG4AtlasApps/test_ATLAS_Template/472/45401.err (/afs/cern.ch/atlas/project/RTT/Work/rel_2/bugfix/build/i686-slc3-gcc323-opt/PyJobTransformsRTT/JobTransform/FullChain.5224.AlpgenJimmyWenuNp3/321/LSFJOB_45401/STDERR) /afs/cern.ch/atlas/project/RTT/Work/rel_2/bugfix/build/i686-slc3-gcc323-opt/G4AtlasApps/AthenaG4AtlasApps/test_ATLAS_Template/474/45422.err (/afs/cern.ch/atlas/project/RTT/Work/rel_2/bugfix/build/i686-slc3-gcc323-opt/PyJobTransformsRTT/JobTransform/Evgen.7218.singlepart_mu20/322/LSFJOB_45422/STDERR) /afs/cern.ch/atlas/project/RTT/Work/rel_2/bugfix/build/i686-slc3-gcc323-opt/G4AtlasApps/AthenaG4AtlasApps/test_ATLAS_Template/484/45438.err (/afs/cern.ch/atlas/project/RTT/Work/rel_2/bugfix/build/i686-slc3-gcc323-opt/EvgenJobTransforms/JobTransform/5224.AlpgenJimmyWenuNp3/208/LSFJOB_45438/STDERRo) /afs/cern.ch/atlas/project/RTT/Work/rel_2/bugfix/build/i686-slc3-gcc323-opt/G4AtlasApps/AthenaG4AtlasApps/test_ATLAS_Template/486/45454.err (/afs/cern.ch/atlas/project/RTT/Work/rel_2/bugfix/build/i686-slc3-gcc323-opt/EvgenJobTransforms/JobTransform/5200.T1_McAtNlo_Jimmy/209/LSFJOB_45454/STDERR)
    • stderr not available /afs/cern.ch/atlas/project/RTT/Work/rel_2/bugfix/build/i686-slc3-gcc323-opt/G4AtlasApps/AthenaG4AtlasApps/test_ATLAS_GeoTest/450/44978.err (/afs/cern.ch/user/r/rtt//LSFJOB_44978/STDERR) /afs/cern.ch/atlas/project/RTT/Work/rel_2/bugfix/build/i686-slc3-gcc323-opt/G4AtlasApps/AthenaG4AtlasApps/test_ATLAS_Template/452/45023.err (/afs/cern.ch/user/r/rtt//LSFJOB_45023/STDERR) /afs/cern.ch/atlas/project/RTT/Work/rel_2/bugfix/build/i686-slc3-gcc323-opt/G4AtlasApps/AthenaG4AtlasApps/test_ATLAS_Template/454/45063.err (/afs/cern.ch/user/r/rtt//LSFJOB_45063/STDERR) /afs/cern.ch/atlas/project/RTT/Work/rel_2/bugfix/build/i686-slc3-gcc323-opt/G4AtlasApps/AthenaG4AtlasApps/test_G4AtlasTests/448/44888.err (/afs/cern.ch/user/r/rtt//LSFJOB_44888/STDERR)

2007/05/15 rel_2

  • val i686-slc4-gcc34-dbg: Extra Info: No NICOS build.
  • No build 13.0.X, i686-slc3-gcc323-opt

2007/05/14 rel_1

  • build 'Pythia_i' failed in 13.0.X, i686-slc3-gcc323-opt

2007/05/12 rel_6


Package Issues

Gen on the fly. single-e-pt50-eta2.5
  • 07/05/23 rel_3/val/build run --- i686-slc4-gcc34-dbg --- test_ATLAS_Template454
    success
    CPU time: 22105 s
    CPU time 2000: 59369 s
    Walltime: 24134 s

Gen on the fly. single-pi-pt50-eta5.0

Read from file. T1_McAtNlo_Jimmy
  • 07/05/22 rel_2/val/build run --- i686-slc4-gcc34-dbg --- AtlasProduction
    CPU time 2000: 20398 s
                 G4AtlasAlg: Event Nr. 9 start processing 
        WARNING - G4Navigator::ComputeStep()
                  Track stuck, not moving for 10 steps
                  in volume -TRT::Shell0- at point (-368.3218284,-567.6760651,340.9602926)
                  direction: (-0.5621309248,0.8264579914,0.03124118703).
                  Potential geometry or navigation problem !
                  Trying pushing it of 9e-10 mm ...
        
        Athena           CRITICAL stopped by user interrupt
        /afs/cern.ch/atlas/project/RTT/Work/rel_2/val/build/i686-slc4-gcc34-dbg/offline/G4AtlasApps/AthenaG4AtlasApps/test_ATLAS_Template/450/runScript.sh: line 29:   912 Segmentation fault      athena.py -c 'RTTRunNumber=300401' -bs G4AtlasApps/test_ATLAS_Template.py 0>&-
        
    http://cern.ch/atlasrtt/rel_2/val/build/i686-slc4-gcc34-dbg/offline/G4AtlasApps/AthenaG4AtlasApps/test_ATLAS_Template/450/page4.xml /afs/cern.ch/atlas/project/RTT/Work/rel_2/val/build/i686-slc4-gcc34-dbg/offline/G4AtlasApps/AthenaG4AtlasApps/test_ATLAS_Template/450/

Gen on the fly. single e pt50GeV eta2.5

  • rel_1/bugfix/build run --- i686-slc4-gcc34-opt ---
        Started at Mon May 14 10:46:50 2007
        FATAL 2007-May-14 10:47:42 [static void ers::ErrorHandler::SignalHandler::action(int, siginfo_t*, void*) at ers/src/ErrorHandler.cxx:88] Got signal 11 Segmentation fault (invalid memory reference)
        /afs/cern.ch/atlas/project/RTT/Work/rel_1/bugfix/build/i686-slc4-gcc34-opt/G4AtlasApps/AthenaG4AtlasApps/test_ATLAS_Template/444/runScript.sh: line 29: 10978 Aborted                 athena.py -c 'RTTRunNumber=200101' -bs G4AtlasApps/test_ATLAS_Template.py 0>&-
        
    http://cern.ch/atlasrtt/rel_1/bugfix/build/i686-slc4-gcc34-opt/offline/G4AtlasApps/AthenaG4AtlasApps/test_ATLAS_Template/444/test_ATLAS_Template444_log /afs/cern.ch/atlas/project/RTT/Work/rel_1/bugfix/build/i686-slc4-gcc34-opt/G4AtlasApps/AthenaG4AtlasApps/test_ATLAS_Template/444/ /afs/cern.ch/atlas/project/RTT/Work/rel_1/bugfix/build/i686-slc4-gcc34-opt/PyJobTransformsRTT/JobTransform/FullChain.7218.singlepart_mu20/304/LSFJOB_1179057/STDERR

Gen on the fly. single mu pt50GeV eta3.0

Gen on the fly. single pi pt50GeV eta3.2

  • same error (Killed), different Event no., similar CPU time.
  • probably we can fix this error by using the long queue?

  • 07/05/23 rel_3/val/build run --- i686-slc4-gcc34-dbg --- test_ATLAS_Template466
    error
    CPU time: 12867 s
    CPU time 2000: 34558 s
    Walltime: 15398 s
         GenEvent: #217 ID=1 SignalProcessGenVertex Barcode: 0
    
         ...
    
         /afs/cern.ch/atlas/project/RTT/Work/rel_3/val/build/i686-slc4-gcc34-dbg/offline/G4AtlasApps/AthenaG4AtlasApps/test_ATLAS_Template/466/runScript.sh: line 29: 14054 Killed                  athena.py -c 'RTTRunNumber=200301' -bs G4AtlasApps/test_ATLAS_Template.py 0>&-
         

  • 07/05/20 rel_0/bugfix/build run --- i686-slc4-gcc34-opt --- AtlasProduction
    timedOut
        CPU time:    7167 s
        CPU time 2000:   19249 s
        Walltime:   9280 s
        Memory:   550MB
        V-Memory:   880MB
        Batch Status:   EXIT
    
        No files available
        

  • 07/05/13 rel_0 val i686-slc4-gcc34-dbg test_ATLAS_Template450
            GenEvent: #212
            .../runScript.sh: line 29: 19488 Killed 
        
            CPU time 2000:    34561 s
            queue=atlasrttmedium (8 KSI2K? hours = 28800 s)
            
    /afs/cern.ch/atlas/project/RTT/Work/rel_0/val/build/i686-slc4-gcc34-dbg/EvgenJobTransforms/JobTransform/5101.JimmyWmunu/207/LSFJOB_1160049/STDERR

  • 07/05/13 rel_0 bugfix --- i686-slc4-gcc34-opt test_ATLAS_Template448
        GenEvent: #282
        
    /afs/cern.ch/user/r/rtt//LSFJOB_1156455/STDERR not accessible

  • rel_5/val/build/i686-slc4-gcc34-dbg CPU time 2000: 34555 s
        GenEvent: #215
        .../test_ATLAS_Template/448/runScript.sh: line 29: 32618 Killed
        
    /afs/cern.ch/atlas/project/RTT/Work/rel_5/val/build/i686-slc4-gcc34-dbg/PyJobTransformsRTT/JobTransform/FullChain.5224.AlpgenJimmyWenuNp3/305/LSFJOB_1056682/STDERR
  • rel_5 07/05/10 bugfix --- i686-slc4-gcc34-opt
         GenEvent: #278
         

  • rel_4/val/build/i686-slc4-gcc34-dbg CPU time 2000: 34574 s
        Event: #210
        .../test_ATLAS_Template/448/runScript.sh: line 29: 12474 Killed
        
    /afs/cern.ch/atlas/project/RTT/Work/rel_4/val/build/i686-slc4-gcc34-dbg/MuonDigiExample/AthenaMuonDigiExample/CSCDigitValidationOptions_RTT/282/LSFJOB_1041972/STDERR

  • rel_4 07/05/10 bugfix --- i686-slc4-gcc34-opt test_ATLAS_Template448
        GenEvent: #294
        

  • rel_6/val/build/i686-slc4-gcc34-dbg 07/04/21@12:00 test_ATLAS_Template430
        GenEvent: #221        
        

Read from file. single particles
  • succeeds occasionally (randomly)...

  • 07/05/31 rel_4 val i686-slc4-gcc34-opt test_ATLAS_Template477
        castor:/castor/cern.ch/atlas/project/muon/validation/performance/evgen/test.009996.evgen.mu_pt5_eta60._0001.pool.root   Always Root file version:31002
        ...
            End of Event nr. 268
        ...
        CollectionTree(AthenaHitsVector<CSCSimHit>/CSC_Hits)    Error Every branch must have the same number of entries.
        ...
        PersistencySvc::GlobalTransaction    Error Could not commit the transaction for the database with
        PersistencySvc::GlobalTransaction    Error FID = D4C01A4A-500F-DC11-9AE9-000423D5AEDE
        PersistencySvc::GlobalTransaction    Error PFN = atlas_MyOutputFile.root
        PoolSvc             ERROR POOL commit failed 0xab38988
        AthenaPoolCnvSvc    ERROR commitOutput FAILED to commit OutputStream.
        ToolSvc.Stream1...  ERROR Unable to commit output atlas_MyOutputFile.root
        Stream1             ERROR commitOutput failed.
        AthenaEventLoopMgr  ERROR Terminating event processing loop due to errors
        Py:G4AtlasApps::PyG4Atlas    DEBUG  G4AtlasEngine::app_profiler
        ...
            End of run - time spent is 164.9200
            Average time per event was 0.5590 +- 0.0412
        

  • val i686-slc4-gcc34-dbg rel_0 test_ATLAS_Template452,454,458,470,472
            beginOfRun
            FATAL ... Segmentation fault (invalid memory reference)
    
            #0 ers::LocalContext::LocalContext(char const*, char const*, int, char const*) from /afs/cern.ch/atlas/project/tdaq/cmt/tdaq-common/tdaq-common-01-06-01/installed/i686-slc4-gcc34-dbg/lib/libers.so
            
    /afs/cern.ch/atlas/project/RTT/Work/rel_0/val/build/i686-slc4-gcc34-dbg/EvgenJobTransforms/JobTransform/5200.T1_McAtNlo_Jimmy/209/LSFJOB_1160053/STDERR /afs/cern.ch/atlas/project/RTT/Work/rel_0/val/build/i686-slc4-gcc34-dbg/EvgenJobTransforms/JobTransform/5200.T1_McAtNlo_Jimmy/209/LSFJOB_1160056/STDERR /afs/cern.ch/atlas/project/RTT/Work/rel_0/val/build/i686-slc4-gcc34-dbg/GeneratorsRTT/AthenaQuickGenCheck/J1_pythia_jetjet.rtt/352/LSFJOB_1160063/STDERR /afs/cern.ch/atlas/project/RTT/Work/rel_0/val/build/i686-slc4-gcc34-dbg/PyJobTransformsRTT/JobTransform/FullChain.7218.singlepart_mu20/306/LSFJOB_1160075/STDERR /afs/cern.ch/atlas/project/RTT/Work/rel_0/val/build/i686-slc4-gcc34-dbg/PyJobTransformsRTT/JobTransform/FullChain.5224.AlpgenJimmyWenuNp3/307/LSFJOB_1160085/STDERR

  • 07/05/13 rel_0 bugfix --- i686-slc4-gcc34-opt
        FATAL ... Got signal 11 Segmentation fault (invalid memory reference)
        
    /afs/cern.ch/user/r/rtt/LSFJOB_1156461/STDERR not accessible
    /afs/cern.ch/user/r/rtt/LSFJOB_1156473/STDERR not accessible
    /afs/cern.ch/user/r/rtt/LSFJOB_1156481/STDERR not accessible

  • 07/05/11 rel_5 bugfix --- i686-slc4-gcc34-opt
        beginOfRun
        Segmentation fault (invalid memory reference)
        

  • 07/05/10 rel_4 bugfix --- i686-slc4-gcc34-opt test_ATLAS_Template450,452,456,458,470
        beginOfRun
        

  • 07/04/21@12:00 rel_6/val/build/i686-slc4-gcc34-dbg test_ATLAS_Template432
        beginOfRun phase
        


SimuJobTransforms

T1_McAtNlo_Jimmy
  • ERROR; TRF_UNKNOWN (69999); PoolSvc; Failed to set POOL property, TREE_MAX_SIZE to 1099511627776L

  • 5/18 rel_5/val/build run --- i686-slc4-gcc34-dbg --- T1_McAtNlo_Jimmy451
        ===== Job Report produced by csc_atlasG4 version SimuJobTransforms-00-07-18 =====
        Command=/afs/cern.ch/atlas/software/builds/nightlies/val/AtlasProduction/rel_5/InstallArea/share/bin/csc_atlasG4_trf.py inputEvgenFile=rfio:/castor/cern.ch/atlas/project/simulation/validation/evgen/csc11.005200.T1_McAtNlo_Jimmy.evgen.EVNT.v11000401._00001.pool.root outputHitsFile=test.root maxEvents=1 skipEvents=0 randomSeed=10 geometryVersion=ATLAS-CSC-01-02-00
        ExitCode=99
        ErrorCode=69999 (TRF_UNKNOWN)
        ErrorCategory=TRF_UNKNOWN,   69999,   Unknown Transform error (2 times)
        Fatals=0
        Errors=1
          csc_atlasG4: 1
        Warnings=63
          csc_atlasG4: 63
        ErrorInfo
          acronym=TRF_UNKNOWN (69999)
          severity=ERROR
          who=PoolSvc
          message=Failed to set POOL property, TREE_MAX_SIZE to 1099511627776L
          producer=csc_atlasG4
          stage=execute
          events=3
        AtlasRelease=rel_5
        DBRelease=
        Workdir=/afs/cern.ch/atlas/project/RTT/Work/rel_5/val/build/i686-slc4-gcc34-dbg/offline/SimuJobTransforms/JobTransform/T1_McAtNlo_Jimmy/451
        RunDirUsedDisk=2258906
        RunDirAvailableDisk=9216000000
        Writing jobInfo.xml file...
        


Branch issues
bugfix i686-slc3-gcc323-opt
  • 07/05/23 rel_3/bugfix/build run --- i686-slc3-gcc323-opt
           File "/afs/cern.ch/atlas/software/builds/nightlies/bugfix/AtlasSimulation/rel_3/InstallArea/python/G4AtlasApps/PyG4Atlas.py", line 2077, in _do_PreInit
             raise RuntimeError('SimSkeleton: found problems with the '+\
         RuntimeError: SimSkeleton: found problems with the method  _do_persitency
         athena> 
         ApplicationMgr      FATAL finalize: Invalid state "Configured"
         


RTT Summary Tables

#RTT
Test Description Branch/Platform 07/06/04 (rel_1) 07/06/03 (rel_0) 07/06/02 (rel_6) 07/06/01 (rel_5) 07/05/31 (rel_4) 07/05/30 (rel_3) 07/05/29 (rel_2) 07/05/28 (rel_1) 07/05/27 (rel_0) 07/05/26 (rel_6) 07/05/25 (rel_5) 07/05/24 (rel_4) 07/05/23 (rel_3) 07/05/22 (rel_2) 07/05/21 (rel_1) 07/05/20 (rel_0) 07/05/19 (rel_6) 07/05/18 (rel_5) 07/05/17 (rel_4) 07/05/16 rel_3 07/05/15 rel_2 07/05/14 rel_1 07/05/13 rel_0 07/05/12 rel_6 07/05/11 rel_5 07/05/10 rel_4 07/05/09 rel_3 07/05/08 rel_2 07/05/05 rel_6
G4AtlasApps
bugfix i686-slc4-gcc34-opt
<!--07/06/04 (rel_1)-->
1. 16/8/0
<!--07/06/03 (rel_0)-->
0. 16/8/0
<!--07/06/02 (rel_6)-->
6. 16/8/0
<!--07/06/01 (rel_5)-->
5. x
<!--07/05/31 (rel_4)-->
4. 16/8/0
<!--07/05/30 (rel_3)-->
3. 16/8/0
<!--07/05/29 (rel_2)-->
16/8/0
<!--07/05/28 (rel_1)-->
x
<!--07/05/27 (rel_0)-->
x
<!--07/05/26 (rel_6)-->
15/8/0
<!--07/05/25 (rel_5)-->
15/10/0
<!--07/05/24 (rel_4)-->
15/7/0
<!--07/05/23 (rel_3)-->
15/8/0
<!--07/05/22 (rel_2)-->
15/6/0
<!--07/05/21 (rel_1)-->
15/5/0
<!--rel_0-->
15/5/0
<!--rel_6-->
15/8/0
<!--rel_5-->
15/8/0
<!--rel_4-->
x
<!--rel_3-->
x
<!--rel_2-->
15/8/0
<!--rel_1-->
15/10/0
<!--rel_0-->
15/8/0
<!--rel_6-->
15/0/0
<!--rel_5-->
15/9/0
<!--rel_4-->
15/8/0
<!--rel_3-->
15/7/0
bugfix i686-slc3-gcc323-opt
<!--07/06/04 (rel_1)-->
1.
<!--07/06/03 (rel_0)-->
0.
<!--07/06/02 (rel_6)-->
6.
<!--07/06/01 (rel_5)-->
5.
<!--07/05/31 (rel_4)-->
<!--07/05/30 (rel_3)-->
<!--07/05/29 (rel_2)-->
2. 16/11/0
<!--07/05/28 (rel_1)-->
x
<!--07/05/27 (rel_0)-->
x
<!--07/05/26 (rel_6)-->
16/11/5/0
<!--07/05/25 (rel_5)-->
15/0/0 >>
<!--07/05/24 (rel_4)-->
15/0/0
<!--07/05/23 (rel_3)-->
15/0/0
<!--07/05/22 (rel_2)-->
x
<!--07/05/21 (rel_1)-->
15/8/0
<!--07/05/20 rel_0-->
x
<!--07/05/19 rel_6-->
x
<!--rel_5-->
15/7/0
<!--rel_4-->
x
<!--rel_3-->
x
<!--rel_2-->
15/0/0
<!--rel_1-->
15/10/0
<!--rel_0-->
15/9/0
<!--rel_6-->
15/9/0
<!--rel_5-->
15/8/0
<!--rel_4-->
15/1/0
<!--rel_3-->
15/9/0
val i686-slc4-gcc34-dbg
<!--07/06/04 (rel_1)-->
1.
<!--07/06/03 (rel_0)-->
0.
<!--07/06/02 (rel_6)-->
6.
<!--07/06/01 (rel_5)-->
5.
<!--07/05/31 (rel_4)-->
4.
<!--07/05/30 (rel_3)-->
3. 16/9/0
<!--07/05/29 (rel_2)-->
2. 16/7/0
<!--07/05/28 (rel_1)-->
x
<!--07/05/27 (rel_0)-->
x
<!--07/05/26 (rel_6)-->
16/15/7/0
<!--07/05/25 (rel_5)-->
16/8/0
<!--07/05/24 (rel_4)-->
15/7/0
<!--07/05/23 (rel_3)-->
15/9/0
<!--07/05/22 (rel_2)-->
15/4/0
<!--07/05/21 (rel_1)-->
15/13/0
<!--rel_0-->
15/8/0
<!--rel_6-->
x
<!--rel_5-->
15/8/0
<!--rel_4-->
x
<!--rel_3-->
x
<!--rel_2-->
15/12/0
<!--rel_1-->
15/7/0
<!--rel_0-->
15/9/0
<!--rel_6-->
---
<!--rel_5-->
15/8/0
<!--rel_4-->
15/10/0
<!--rel_3-->
15/8/0
<!--rel_2-->
<!--rel_6-->
15/8/0
val i686-slc4-gcc34-opt
<!--07/06/04 (rel_1)-->
1. 16/7/0
<!--07/06/03 (rel_0)-->
0. 16/7/0
<!--07/06/02 (rel_6)-->
6. 16/7/0
<!--07/06/01 (rel_5)-->
5. 16/10/0 >>
<!--07/05/31 (rel_4)-->
4. 16/14/9/0
dev i686-slc4-gcc34-opt
<!--07/06/04 (rel_1)-->
1. 16/0/0
<!--07/06/03 (rel_0)-->
0. 16/0/0
<!--07/06/02 (rel_6)-->
6. 16/0/0
<!--07/06/01 (rel_5)-->
5.
<!--07/05/31 (rel_4)-->
4. 16/0/0 >>
<!--07/05/30 (rel_3)-->
3. 16/1/0
<!--07/05/29 (rel_2)-->
2. 16/1/0
SimuJobTransforms
bugfix i686-slc4-gcc34-opt
<!--07/06/04 (rel_1)-->
1. 3/0/0
<!--07/06/03 (rel_0)-->
0. 3/0/0
<!--07/06/02 (rel_6)-->
6. 3/0/0
<!--07/06/01 (rel_5)-->
5. x
<!--07/05/31 (rel_4)-->
4. 3/0/0
<!--07/05/30 (rel_3)-->
3. 3/0/0
<!--07/05/29 (rel_2)-->
2. 3/1/0
<!--07/05/28 (rel_1)-->
1. x
<!--07/05/27 (rel_0)-->
0. x
<!--07/05/26 (rel_6)-->
6. 3/0/0
<!--07/05/25 (rel_5)-->
5. 3/0/0
<!--07/05/24 (rel_4)-->
4. 1/1/0
<!--07/05/23 (rel_3)-->
3. 1/1/0
<!--07/05/22 (rel_2)-->
2. 1/1/0
bugfix i686-slc3-gcc323-opt
<!--07/06/04 (rel_1)-->
1.
<!--07/06/03 (rel_0)-->
0.
<!--07/06/02 (rel_6)-->
6.
<!--07/06/01 (rel_5)-->
5.
<!--07/05/31 (rel_4)-->
4.
<!--07/05/30 (rel_3)-->
3.
<!--07/05/29 (rel_2)-->
2. 3/0/0
<!--07/05/28 (rel_1)-->
1. x
<!--07/05/27 (rel_0)-->
0. x
<!--07/05/26 (rel_6)-->
6. 3/1/0
<!--07/05/25 (rel_5)-->
5. 3/1/0
<!--07/05/24 (rel_4)-->
4. 1/1/0
<!--07/05/23 (rel_3)-->
3. 1/1/0
<!--07/05/22 (rel_2)-->
2. x
val i686-slc4-gcc34-opt
<!--07/06/04 (rel_1)-->
1. 3/0/0
<!--07/06/03 (rel_0)-->
0. 3/0/0
<!--07/06/02 (rel_6)-->
6. 3/0/0
<!--07/06/01 (rel_5)-->
5. 3/0/0
<!--07/05/31 (rel_4)-->
4. 3/0/0
val i686-slc4-gcc34-dbg
<!--07/06/04 (rel_1)-->
1.
<!--07/06/03 (rel_0)-->
0.
<!--07/06/02 (rel_6)-->
6.
<!--07/06/01 (rel_5)-->
5. x
<!--07/05/31 (rel_4)-->
4. x
<!--07/05/30 (rel_3)-->
3. 3/1/0
<!--07/05/29 (rel_2)-->
2. 3/0/0
<!--07/05/28 (rel_1)-->
1. x
<!--07/05/27 (rel_0)-->
0. x
<!--07/05/26 (rel_6)-->
6. 3/0/0
<!--07/05/25 (rel_5)-->
5. 3/0/0
<!--07/05/24 (rel_4)-->
4. 1/1/1
<!--07/05/23 (rel_3)-->
3. 1/1/0
<!--07/05/22 (rel_2)-->
2. 1/1/0
dev i686-slc4-gcc34-opt
<!--07/06/04 (rel_1)-->
1. 3/0/0
<!--07/06/03 (rel_0)-->
0. 3/1/0
<!--07/06/02 (rel_6)-->
6. 3/1/0
<!--07/06/01 (rel_5)-->
5. x
<!--07/05/31 (rel_4)-->
4. 3/1/0
<!--07/05/30 (rel_3)-->
3. 3/1/0
<!--07/05/29 (rel_2)-->
2. 3/1/0

Test Description Branch/Platform 07/06/01 (rel_5) 07/05/31 (rel_4) 07/05/30 (rel_3) 07/05/29 (rel_2) 07/05/28 (rel_1) 07/05/27 (rel_0) 07/05/26 (rel_6) 07/05/25 (rel_5) 07/05/24 (rel_4) 07/05/23 (rel_3) 07/05/22 (rel_2) 07/05/21 (rel_1) 07/05/20 (rel_0) 07/05/19 (rel_6) 07/05/18 (rel_5) 07/05/17 (rel_4) 07/05/16 rel_3 07/05/15 rel_2 07/05/14 rel_1 07/05/13 rel_0 07/05/12 rel_6 07/05/11 rel_5 07/05/10 rel_4 07/05/09 rel_3 07/05/08 rel_2 07/05/05 rel_6
Test with commisioning layouts and cosmic generator
<!-- jobOptions.G4Cosmic -->
bugfix i686-slc4-gcc34-opt
<!--07/06/01 (rel_5)-->
5.
<!--07/05/31 (rel_4)-->
4. batchError
<!--07/05/30 (rel_3)-->
3. error
<!--07/05/29 (rel_2)-->
error
<!--07/05/28 (rel_1)-->
<!--07/05/27 (rel_0)-->
<!--07/05/26 (rel_6)-->
error
<!--07/05/25 (rel_5)-->
bugfix i686-slc3-gcc323-opt
<!-- jobOptions.G4Cosmic -->
<!--07/06/01 (rel_5)-->
5.
<!--07/05/31 (rel_4)-->
4.
<!--07/05/30 (rel_3)-->
3.
<!--07/05/29 (rel_2)-->
2. success
<!--07/05/28 (rel_1)-->
<!--07/05/27 (rel_0)-->
<!--07/05/26 (rel_6)-->
success
<!--07/05/25 (rel_5)-->
val i686-slc4-gcc34-dbg
<!-- jobOptions.G4Cosmic -->
<!--07/06/01 (rel_5)-->
5.
<!--07/05/31 (rel_4)-->
4.
<!--07/05/30 (rel_3)-->
3. error
<!--07/05/29 (rel_2)-->
2. error
<!--07/05/28 (rel_1)-->
<!--07/05/27 (rel_0)-->
<!--07/05/26 (rel_6)-->
error
<!--07/05/25 (rel_5)-->
error
val i686-slc4-gcc34-opt
<!-- jobOptions.G4Cosmic -->
<!--07/06/01 (rel_5)-->
5. success
<!--07/05/31 (rel_4)-->
4. error
dev i686-slc4-gcc34-opt
<!-- jobOptions.G4Cosmic -->
<!--07/06/01 (rel_5)-->
5.
<!--07/05/31 (rel_4)-->
4. error
<!--07/05/30 (rel_3)-->
3. error
<!--07/05/29 (rel_2)-->
2. error
Recursive geometry test bugfix i686-slc4-gcc34-opt
<!--07/06/01 (rel_5)-->
5.
<!--07/05/31 (rel_4)-->
4. success
<!--07/05/30 (rel_3)-->
3. success
<!--07/05/29 (rel_2)-->
success
<!--07/05/28 (rel_1)-->
<!--07/05/27 (rel_0)-->
<!--07/05/26 (rel_6)-->
success
<!--07/05/25 (rel_5)-->
success
<!--07/05/24 (rel_4)-->
success
<!--07/05/23 (rel_3)-->
success
<!--07/05/22 (rel_2)-->
success
<!--07/05/21 (rel_1)-->
success
<!--rel_0-->
success
<!--rel_6-->
success
<!--rel_5-->
success
<!--rel_4-->
x
<!--rel_3-->
x
<!--rel_2-->
success
<!--rel_1-->
success
<!--rel_0-->
success
<!--rel_6-->
error
<!--rel_5-->
success
<!--rel_4-->
error
<!--rel_3-->
success
bugfix i686-slc3-gcc323-opt
<!-- Recursive geometry test -->
<!--07/06/01 (rel_5)-->
5.
<!--07/05/31 (rel_4)-->
4.
<!--07/05/30 (rel_3)-->
3.
<!--07/05/29 (rel_2)-->
2. success
<!--07/05/28 (rel_1)-->
<!--07/05/27 (rel_0)-->
<!--07/05/26 (rel_6)-->
success
<!--07/05/25 (rel_5)-->
error
<!--07/05/24 (rel_4)-->
error
<!--07/05/23 (rel_3)-->
error
<!--07/05/22 (rel_2)-->
x
<!--07/05/21 (rel_1)-->
success
<!--rel_0-->
x
<!--rel_6-->
success
<!--rel_5-->
success
<!--rel_4-->
x
<!--rel_3-->
x
<!--rel_2-->
x
<!--rel_1-->
success
<!--rel_0-->
success
<!--rel_6-->
success
<!--rel_5-->
success
<!--rel_4-->
success
<!--rel_3-->
success
val i686-slc4-gcc34-dbg
<!-- Recursive geometry test -->
<!--07/06/01 (rel_5)-->
5.
<!--07/05/31 (rel_4)-->
4.
<!--07/05/30 (rel_3)-->
3. success
<!--07/05/29 (rel_2)-->
2. success
<!--07/05/28 (rel_1)-->
<!--07/05/27 (rel_0)-->
<!--07/05/26 (rel_6)-->
success
<!--07/05/25 (rel_5)-->
success
<!--07/05/24 (rel_4)-->
success
<!--07/05/23 (rel_3)-->
success
<!--07/05/22 (rel_2)-->
success
<!--07/05/21 (rel_1)-->
success
<!--rel_0-->
success
<!--07/05/19 rel_6-->
x
<!--rel_5-->
success
<!--rel_4-->
x
<!--rel_3-->
x
<!--rel_2-->
success
<!--rel_1-->
success
<!--rel_0-->
success
<!--rel_6-->
<!--rel_5-->
success
<!--rel_4-->
success
<!--rel_3-->
success
<!--rel_2-->
<!--rel_6-->
success
val i686-slc4-gcc34-opt
<!-- Recursive geometry test -->
<!--07/06/01 (rel_5)-->
5. success
<!--07/05/31 (rel_4)-->
4. success
dev i686-slc4-gcc34-opt
<!-- Recursive geometry test -->
<!--07/06/01 (rel_5)-->
5.
<!--07/05/31 (rel_4)-->
4. error
<!--07/05/30 (rel_3)-->
3. success
<!--07/05/29 (rel_2)-->
2. success
Gen on the fly. single-e-pt50-eta2.5 bugfix i686-slc4-gcc34-opt
<!--07/06/01 (rel_5)-->
5.
<!--07/05/31 (rel_4)-->
4. batchError
<!--07/05/30 (rel_3)-->
3. success
<!--07/05/29 (rel_2)-->
success
<!--07/05/28 (rel_1)-->
<!--07/05/27 (rel_0)-->
<!--07/05/26 (rel_6)-->
success
<!--07/05/25 (rel_5)-->
success
<!--07/05/24 (rel_4)-->
success
<!--07/05/23 (rel_3)-->
success
<!--07/05/22 (rel_2)-->
error
<!--07/05/21 (rel_1)-->
success
<!--rel_0-->
timedOut >>
<!--rel_6-->
success
<!--rel_5-->
success
<!--rel_4-->
x
<!--rel_3-->
x
<!--rel_2-->
success
<!--rel_1-->
success
<!--rel_0-->
success
<!--rel_6-->
error
<!--rel_5-->
success
<!--rel_4-->
success
<!--rel_3-->
success
bugfix i686-slc3-gcc323-opt
<!-- Gen on the fly. single-e-pt50-eta2.5 -->
<!--07/06/01 (rel_5)-->
5.
<!--07/05/31 (rel_4)-->
4.
<!--07/05/30 (rel_3)-->
3.
<!--07/05/29 (rel_2)-->
2. success
<!--07/05/28 (rel_1)-->
<!--07/05/27 (rel_0)-->
<!--07/05/26 (rel_6)-->
running
<!--07/05/25 (rel_5)-->
error
<!--07/05/24 (rel_4)-->
error
<!--07/05/23 (rel_3)-->
error
<!--07/05/22 (rel_2)-->
x
<!--07/05/21 (rel_1)-->
timedOut
<!--rel_0-->
x
<!--rel_6-->
success
<!--rel_5-->
success
<!--rel_4-->
x
<!--rel_3-->
x
<!--rel_2-->
x
<!--rel_1-->
success
<!--rel_0-->
success
<!--rel_6-->
success
<!--rel_5-->
success
<!--rel_4-->
error
<!--rel_3-->
success
val i686-slc4-gcc34-dbg
<!-- Gen on the fly. single-e-pt50-eta2.5 -->
<!--07/06/01 (rel_5)-->
5.
<!--07/05/31 (rel_4)-->
4.
<!--07/05/30 (rel_3)-->
3. success
<!--07/05/29 (rel_2)-->
2. success
<!--07/05/28 (rel_1)-->
<!--07/05/27 (rel_0)-->
<!--07/05/26 (rel_6)-->
success
<!--07/05/25 (rel_5)-->
success
<!--07/05/24 (rel_4)-->
error
<!--07/05/23 (rel_3)-->
success
<!--07/05/22 (rel_2)-->
error >>
<!--07/05/21 (rel_1)-->
success
<!--rel_0-->
success
<!--07/05/19 rel_6-->
x
<!--rel_5-->
success
<!--rel_4-->
x
<!--rel_3-->
x
<!--rel_2-->
success
<!--rel_1-->
success
<!--rel_0-->
success
<!--rel_6-->
<!--rel_5-->
success
<!--rel_4-->
success
<!--rel_3-->
success
<!--rel_2-->
<!--rel_6-->
success
val i686-slc4-gcc34-opt
<!-- Gen on the fly. single-e-pt50-eta2.5 -->
<!--07/06/01 (rel_5)-->
5. operatorCloseDown
<!--07/05/31 (rel_4)-->
4. success
dev i686-slc4-gcc34-opt
<!-- Gen on the fly. single-e-pt50-eta2.5 -->
<!--07/06/01 (rel_5)-->
5.
<!--07/05/31 (rel_4)-->
4. error
<!--07/05/30 (rel_3)-->
3. error
<!--07/05/29 (rel_2)-->
2. error
Gen on the fly. single-mu-pt100-eta3.0 bugfix i686-slc4-gcc34-opt
<!--07/06/01 (rel_5)-->
5.
<!--07/05/31 (rel_4)-->
4. success
<!--07/05/30 (rel_3)-->
3. success
<!--07/05/29 (rel_2)-->
success
<!--07/05/28 (rel_1)-->
<!--07/05/27 (rel_0)-->
<!--07/05/26 (rel_6)-->
success
<!--07/05/25 (rel_5)-->
success
<!--07/05/24 (rel_4)-->
success
<!--07/05/23 (rel_3)-->
success
<!--07/05/22 (rel_2)-->
error
<!--07/05/21 (rel_1)-->
success
<!--rel_0-->
success
<!--rel_6-->
success
<!--rel_5-->
success
<!--rel_4-->
x
<!--rel_3-->
x
<!--rel_2-->
success
<!--rel_1-->
success
<!--rel_0-->
success
<!--rel_6-->
error
<!--rel_5-->
success
<!--rel_4-->
success
<!--rel_3-->
success
bugfix i686-slc3-gcc323-opt
<!-- Gen on the fly. single-mu-pt100-eta3.0 -->
<!--07/06/01 (rel_5)-->
5.
<!--07/05/31 (rel_4)-->
4.
<!--07/05/30 (rel_3)-->
3.
<!--07/05/29 (rel_2)-->
2. success
<!--07/05/28 (rel_1)-->
<!--07/05/27 (rel_0)-->
<!--07/05/26 (rel_6)-->
success
<!--07/05/25 (rel_5)-->
error
<!--07/05/24 (rel_4)-->
error
<!--07/05/23 (rel_3)-->
error
<!--07/05/22 (rel_2)-->
x
<!--07/05/21 (rel_1)-->
success
<!--rel_0-->
x
<!--rel_6-->
success
<!--rel_5-->
success
<!--rel_4-->
x
<!--rel_3-->
x
<!--rel_2-->
x
<!--rel_1-->
success
<!--rel_0-->
success
<!--rel_6-->
success
<!--rel_5-->
success
<!--rel_4-->
error
<!--rel_3-->
success
val i686-slc4-gcc34-dbg
<!-- Gen on the fly. single-mu-pt100-eta3.0 -->
<!--07/06/01 (rel_5)-->
5.
<!--07/05/31 (rel_4)-->
4.
<!--07/05/30 (rel_3)-->
3. success
<!--07/05/29 (rel_2)-->
2. error >>
<!--07/05/28 (rel_1)-->
<!--07/05/27 (rel_0)-->
<!--07/05/26 (rel_6)-->
success
<!--07/05/25 (rel_5)-->
success
<!--07/05/24 (rel_4)-->
success
<!--07/05/23 (rel_3)-->
success
<!--07/05/22 (rel_2)-->
success
<!--07/05/21 (rel_1)-->
timedOut
<!--rel_0-->
success
<!--07/05/19 rel_6-->
x
<!--rel_5-->
success
<!--rel_4-->
x
<!--rel_3-->
x
<!--rel_2-->
success
<!--rel_1-->
success
<!--rel_0-->
success
<!--rel_6-->
<!--rel_5-->
success
<!--rel_4-->
batchError
<!--rel_3-->
success
<!--rel_2-->
<!--rel_6-->
success
val i686-slc4-gcc34-opt
<!-- Gen on the fly. single-mu-pt100-eta3.0 -->
<!--07/06/01 (rel_5)-->
5. operatorCloseDown
<!--07/05/31 (rel_4)-->
4. success
dev i686-slc4-gcc34-opt
<!-- Gen on the fly. single-mu-pt100-eta3.0 -->
<!--07/06/01 (rel_5)-->
5.
<!--07/05/31 (rel_4)-->
4. error
<!--07/05/30 (rel_3)-->
3. error
<!--07/05/29 (rel_2)-->
2. error
Gen on the fly. single-pi-pt50-eta5.0 bugfix i686-slc4-gcc34-opt
<!--07/06/01 (rel_5)-->
5.
<!--07/05/31 (rel_4)-->
4. success
<!--07/05/30 (rel_3)-->
3. success
<!--07/05/29 (rel_2)-->
success
<!--07/05/28 (rel_1)-->
<!--07/05/27 (rel_0)-->
<!--07/05/26 (rel_6)-->
running
<!--07/05/25 (rel_5)-->
success
<!--07/05/24 (rel_4)-->
success
<!--07/05/23 (rel_3)-->
success
<!--07/05/22 (rel_2)-->
error
<!--07/05/21 (rel_1)-->
error
<!--rel_0-->
timedOut
<!--rel_6-->
success
<!--rel_5-->
success
<!--rel_4-->
x
<!--rel_3-->
x
<!--rel_2-->
success
<!--rel_1-->
success
<!--rel_0-->
success
<!--rel_6-->
error
<!--rel_5-->
success
<!--rel_4-->
success
<!--rel_3-->
success
bugfix i686-slc3-gcc323-opt
<!-- Gen on the fly. single-pi-pt50-eta5.0 -->
<!--07/06/01 (rel_5)-->
5.
<!--07/05/31 (rel_4)-->
4.
<!--07/05/30 (rel_3)-->
3.
<!--07/05/29 (rel_2)-->
2. success
<!--07/05/28 (rel_1)-->
<!--07/05/27 (rel_0)-->
<!--07/05/26 (rel_6)-->
running
<!--07/05/25 (rel_5)-->
error
<!--07/05/24 (rel_4)-->
error
<!--07/05/23 (rel_3)-->
error
<!--07/05/22 (rel_2)-->
x
<!--07/05/21 (rel_1)-->
success
<!--rel_0-->
x
<!--rel_6-->
success
<!--rel_5-->
timedOut >>
<!--rel_4-->
x
<!--rel_3-->
x
<!--rel_2-->
x
<!--rel_1-->
success
<!--rel_0-->
success
<!--rel_6-->
success
<!--rel_5-->
success
<!--rel_4-->
error
<!--rel_3-->
success
val i686-slc4-gcc34-dbg
<!-- Gen on the fly. single-pi-pt50-eta5.0 -->
<!--07/06/01 (rel_5)-->
5.
<!--07/05/31 (rel_4)-->
4.
<!--07/05/30 (rel_3)-->
3. success
<!--07/05/29 (rel_2)-->
2. success
<!--07/05/28 (rel_1)-->
<!--07/05/27 (rel_0)-->
<!--07/05/26 (rel_6)-->
running
<!--07/05/25 (rel_5)-->
success
<!--07/05/24 (rel_4)-->
success
<!--07/05/23 (rel_3)-->
success
<!--07/05/22 (rel_2)-->
error >>
<!--07/05/21 (rel_1)-->
success
<!--rel_0-->
success
<!--07/05/19 rel_6-->
x
<!--rel_5-->
success
<!--rel_4-->
x
<!--rel_3-->
x
<!--rel_2-->
success
<!--rel_1-->
success
<!--rel_0-->
success
<!--rel_6-->
<!--rel_5-->
success
<!--rel_4-->
success
<!--rel_3-->
success
<!--rel_2-->
<!--rel_6-->
success
val i686-slc4-gcc34-opt
<!-- Gen on the fly. single-pi-pt50-eta5.0 -->
<!--07/06/01 (rel_5)-->
5. operatorCloseDown
<!--07/05/31 (rel_4)-->
4. timedOut
dev i686-slc4-gcc34-opt
<!-- Gen on the fly. single-pi-pt50-eta5.0 -->
<!--07/06/01 (rel_5)-->
5.
<!--07/05/31 (rel_4)-->
4. error
<!--07/05/30 (rel_3)-->
3. batchError
<!--07/05/29 (rel_2)-->
2. error
Read from file. T1_McAtNlo_Jimmy bugfix i686-slc4-gcc34-opt
<!--07/06/01 (rel_5)-->
5.
<!--07/05/31 (rel_4)-->
4. success
<!--07/05/30 (rel_3)-->
3. success
<!--07/05/29 (rel_2)-->
success
<!--07/05/28 (rel_1)-->
<!--07/05/27 (rel_0)-->
<!--07/05/26 (rel_6)-->
success
<!--07/05/25 (rel_5)-->
success
<!--07/05/24 (rel_4)-->
success
<!--07/05/23 (rel_3)-->
success
<!--07/05/22 (rel_2)-->
success
<!--07/05/21 (rel_1)-->
success
<!--rel_0-->
success
<!--rel_6-->
success
<!--rel_5-->
success
<!--rel_4-->
x
<!--rel_3-->
x
<!--rel_2-->
success
<!--rel_1-->
success
<!--rel_0-->
success
<!--rel_6-->
error
<!--rel_5-->
success
<!--rel_4-->
success
<!--rel_3-->
success
bugfix i686-slc3-gcc323-opt
<!-- Read from file. T1_McAtNlo_Jimmy -->
<!--07/06/01 (rel_5)-->
5.
<!--07/05/31 (rel_4)-->
4.
<!--07/05/30 (rel_3)-->
3.
<!--07/05/29 (rel_2)-->
2. success
<!--07/05/28 (rel_1)-->
<!--07/05/27 (rel_0)-->
<!--07/05/26 (rel_6)-->
running
<!--07/05/25 (rel_5)-->
error
<!--07/05/24 (rel_4)-->
error
<!--07/05/23 (rel_3)-->
error
<!--07/05/22 (rel_2)-->
x
<!--07/05/21 (rel_1)-->
success
<!--rel_0-->
x
<!--rel_6-->
success
<!--rel_5-->
success
<!--rel_4-->
x
<!--rel_3-->
x
<!--rel_2-->
x
<!--rel_1-->
success
<!--rel_0-->
success
<!--rel_6-->
success
<!--rel_5-->
success
<!--rel_4-->
error
<!--rel_3-->
success
val i686-slc4-gcc34-dbg
<!-- Read from file. T1_McAtNlo_Jimmy -->
<!--07/06/01 (rel_5)-->
5.
<!--07/05/31 (rel_4)-->
4.
<!--07/05/30 (rel_3)-->
3. success
<!--07/05/29 (rel_2)-->
2. success
<!--07/05/28 (rel_1)-->
<!--07/05/27 (rel_0)-->
<!--07/05/26 (rel_6)-->
success
<!--07/05/25 (rel_5)-->
success
<!--07/05/24 (rel_4)-->
success
<!--07/05/23 (rel_3)-->
success
<!--07/05/22 (rel_2)-->
error >>
<!--07/05/21 (rel_1)-->
success
<!--rel_0-->
success
<!--07/05/19 rel_6-->
x
<!--rel_5-->
success
<!--rel_4-->
x
<!--rel_3-->
x
<!--rel_2-->
success
<!--rel_1-->
error
<!--rel_0-->
success
<!--rel_6-->
<!--rel_5-->
success
<!--rel_4-->
success
<!--rel_3-->
success
<!--rel_2-->
<!--rel_6-->
success
val i686-slc4-gcc34-opt
<!-- Read from file. T1_McAtNlo_Jimmy -->
<!--07/06/01 (rel_5)-->
5. operatorCloseDown
<!--07/05/31 (rel_4)-->
4. success
dev i686-slc4-gcc34-opt
<!-- Read from file. T1_McAtNlo_Jimmy -->
<!--07/06/01 (rel_5)-->
5.
<!--07/05/31 (rel_4)-->
4. error
<!--07/05/30 (rel_3)-->
3. error
<!--07/05/29 (rel_2)-->
2. error
Gen on the fly. single e pt50GeV eta2.5 bugfix i686-slc4-gcc34-opt
<!--07/06/01 (rel_5)-->
5.
<!--07/05/31 (rel_4)-->
4. success
<!--07/05/30 (rel_3)-->
3. success
<!--07/05/29 (rel_2)-->
success
<!--07/05/28 (rel_1)-->
<!--07/05/27 (rel_0)-->
<!--07/05/26 (rel_6)-->
success
<!--07/05/25 (rel_5)-->
success
<!--07/05/24 (rel_4)-->
timedOut
<!--07/05/23 (rel_3)-->
success
<!--07/05/22 (rel_2)-->
success
<!--07/05/21 (rel_1)-->
error
<!--rel_0-->
timedOut
<!--rel_6-->
success
<!--rel_5-->
success
<!--rel_4-->
x
<!--rel_3-->
x
<!--rel_2-->
success
<!--rel_1-->
error
<!--rel_0-->
success
<!--rel_6-->
error
<!--rel_5-->
success
<!--rel_4-->
success
<!--rel_3-->
error
bugfix i686-slc3-gcc323-opt
<!-- Gen on the fly. single e pt50GeV eta2.5 -->
<!--07/06/01 (rel_5)-->
5.
<!--07/05/31 (rel_4)-->
4.
<!--07/05/30 (rel_3)-->
3.
<!--07/05/29 (rel_2)-->
2. success
<!--07/05/28 (rel_1)-->
<!--07/05/27 (rel_0)-->
<!--07/05/26 (rel_6)-->
running
<!--07/05/25 (rel_5)-->
error
<!--07/05/24 (rel_4)-->
error
<!--07/05/23 (rel_3)-->
error
<!--07/05/22 (rel_2)-->
x
<!--07/05/21 (rel_1)-->
success
<!--rel_0-->
x
<!--rel_6-->
success
<!--rel_5-->
success
<!--rel_4-->
x
<!--rel_3-->
x
<!--rel_2-->
x
<!--rel_1-->
success
<!--rel_0-->
success
<!--rel_6-->
success
<!--rel_5-->
success
<!--rel_4-->
error
<!--rel_3-->
success
val i686-slc4-gcc34-dbg
<!-- Gen on the fly. single e pt50GeV eta2.5 -->
<!--07/06/01 (rel_5)-->
5.
<!--07/05/31 (rel_4)-->
4.
<!--07/05/30 (rel_3)-->
3. success
<!--07/05/29 (rel_2)-->
2. success
<!--07/05/28 (rel_1)-->
<!--07/05/27 (rel_0)-->
<!--07/05/26 (rel_6)-->
success
<!--07/05/25 (rel_5)-->
success
<!--07/05/24 (rel_4)-->
success
<!--07/05/23 (rel_3)-->
success
<!--07/05/22 (rel_2)-->
error >>
<!--07/05/21 (rel_1)-->
success
<!--rel_0-->
success
<!--07/05/19 rel_6-->
x
<!--rel_5-->
success
<!--rel_4-->
x
<!--rel_3-->
x
<!--rel_2-->
success
<!--rel_1-->
success
<!--rel_0-->
success
<!--rel_6-->
<!--rel_5-->
success
<!--rel_4-->
success
<!--rel_3-->
success
<!--rel_2-->
<!--rel_6-->
success
val i686-slc4-gcc34-opt
<!-- Gen on the fly. single e pt50GeV eta2.5 -->
<!--07/06/01 (rel_5)-->
5. operatorCloseDown
<!--07/05/31 (rel_4)-->
4. success
dev i686-slc4-gcc34-opt
<!-- Gen on the fly. single e pt50GeV eta2.5 -->
<!--07/06/01 (rel_5)-->
5.
<!--07/05/31 (rel_4)-->
4. error
<!--07/05/30 (rel_3)-->
3. error
<!--07/05/29 (rel_2)-->
2. error
Gen on the fly. single mu pt50GeV eta3.0 bugfix i686-slc4-gcc34-opt
<!--07/06/01 (rel_5)-->
5.
<!--07/05/31 (rel_4)-->
4. success
<!--07/05/30 (rel_3)-->
3. success
<!--07/05/29 (rel_2)-->
success
<!--07/05/28 (rel_1)-->
<!--07/05/27 (rel_0)-->
<!--07/05/26 (rel_6)-->
success
<!--07/05/25 (rel_5)-->
success
<!--07/05/24 (rel_4)-->
success
<!--07/05/23 (rel_3)-->
success
<!--07/05/22 (rel_2)-->
success
<!--07/05/21 (rel_1)-->
error
<!--rel_0-->
success
<!--rel_6-->
success
<!--07/05/18 rel_5-->
error >>
<!--rel_4-->
x
<!--rel_3-->
x
<!--rel_2-->
success
<!--rel_1-->
success
<!--rel_0-->
success
<!--rel_6-->
error
<!--rel_5-->
success
<!--rel_4-->
success
<!--rel_3-->
success
bugfix i686-slc3-gcc323-opt
<!-- Gen on the fly. single mu pt50GeV eta3.0 -->
<!--07/06/01 (rel_5)-->
5.
<!--07/05/31 (rel_4)-->
4.
<!--07/05/30 (rel_3)-->
3.
<!--07/05/29 (rel_2)-->
2. success
<!--07/05/28 (rel_1)-->
<!--07/05/27 (rel_0)-->
<!--07/05/26 (rel_6)-->
success
<!--07/05/25 (rel_5)-->
error
<!--07/05/24 (rel_4)-->
error
<!--07/05/23 (rel_3)-->
error
<!--07/05/22 (rel_2)-->
x
<!--07/05/21 (rel_1)-->
success
<!--rel_0-->
x
<!--rel_6-->
success
<!--rel_5-->
success
<!--rel_4-->
x
<!--rel_3-->
x
<!--rel_2-->
x
<!--rel_1-->
success
<!--rel_0-->
success
<!--rel_6-->
success
<!--rel_5-->
success
<!--rel_4-->
error
<!--rel_3-->
success
val i686-slc4-gcc34-dbg
<!-- Gen on the fly. single mu pt50GeV eta3.0 -->
<!--07/06/01 (rel_5)-->
5.
<!--07/05/31 (rel_4)-->
4.
<!--07/05/30 (rel_3)-->
3. success
<!--07/05/29 (rel_2)-->
2. error >>
<!--07/05/28 (rel_1)-->
<!--07/05/27 (rel_0)-->
<!--07/05/26 (rel_6)-->
success
<!--07/05/25 (rel_5)-->
success
<!--07/05/24 (rel_4)-->
success
<!--07/05/23 (rel_3)-->
success
<!--07/05/22 (rel_2)-->
success
<!--07/05/21 (rel_1)-->
success
<!--rel_0-->
success
<!--07/05/19 rel_6-->
x
<!--rel_5-->
success
<!--rel_4-->
x
<!--rel_3-->
x
<!--rel_2-->
success
<!--rel_1-->
success
<!--rel_0-->
success
<!--rel_6-->
<!--rel_5-->
success
<!--rel_4-->
success
<!--rel_3-->
success
<!--rel_2-->
<!--rel_6-->
success
val i686-slc4-gcc34-opt
<!-- Gen on the fly. single mu pt50GeV eta3.0 -->
<!--07/06/01 (rel_5)-->
5. success
<!--07/05/31 (rel_4)-->
4. success
dev i686-slc4-gcc34-opt
<!-- Gen on the fly. single mu pt50GeV eta3.0 -->
<!--07/06/01 (rel_5)-->
5.
<!--07/05/31 (rel_4)-->
4. error
<!--07/05/30 (rel_3)-->
3. batchError
<!--07/05/29 (rel_2)-->
2. error
Gen on the fly. single pi pt50GeV eta3.2 bugfix i686-slc4-gcc34-opt
<!--07/06/01 (rel_5)-->
5.
<!--07/05/31 (rel_4)-->
4. error
<!--07/05/30 (rel_3)-->
3. error
<!--07/05/29 (rel_2)-->
error
<!--07/05/28 (rel_1)-->
<!--07/05/27 (rel_0)-->
<!--07/05/26 (rel_6)-->
error
<!--07/05/25 (rel_5)-->
error
<!--07/05/24 (rel_4)-->
error
<!--07/05/23 (rel_3)-->
error
<!--07/05/22 (rel_2)-->
error
<!--07/05/21 (rel_1)-->
error
<!--rel_0-->
timedOut
<!--rel_6-->
error
<!--rel_5-->
error
<!--rel_4-->
x
<!--rel_3-->
x
<!--rel_2-->
error
<!--rel_1-->
error
<!--rel_0-->
error
<!--rel_6-->
error
<!--rel_5-->
error
<!--rel_4-->
error
<!--rel_3-->
error
bugfix i686-slc3-gcc323-opt
<!-- Gen on the fly. single pi pt50GeV eta3.2 -->
<!--07/06/01 (rel_5)-->
5.
<!--07/05/31 (rel_4)-->
4.
<!--07/05/30 (rel_3)-->
3.
<!--07/05/29 (rel_2)-->
2. success >>
<!--07/05/28 (rel_1)-->
<!--07/05/27 (rel_0)-->
<!--07/05/26 (rel_6)-->
running
<!--07/05/25 (rel_5)-->
error
<!--07/05/24 (rel_4)-->
error
<!--07/05/23 (rel_3)-->
error
<!--07/05/22 (rel_2)-->
x
<!--07/05/21 (rel_1)-->
error
<!--07/05/20 rel_0-->
x
<!--07/05/19 rel_6-->
x
<!--rel_5-->
error
<!--rel_4-->
x
<!--rel_3-->
x
<!--rel_2-->
x
<!--rel_1-->
error
<!--rel_0-->
error
<!--rel_6-->
error
<!--rel_5-->
timedOut
<!--rel_4-->
error
<!--rel_3-->
error
val i686-slc4-gcc34-dbg
<!-- Gen on the fly. single pi pt50GeV eta3.2 -->
<!--07/06/01 (rel_5)-->
5.
<!--07/05/31 (rel_4)-->
4.
<!--07/05/30 (rel_3)-->
3. error
<!--07/05/29 (rel_2)-->
2. error >>
<!--07/05/28 (rel_1)-->
<!--07/05/27 (rel_0)-->
<!--07/05/26 (rel_6)-->
error
<!--07/05/25 (rel_5)-->
error
<!--07/05/24 (rel_4)-->
error
<!--07/05/23 (rel_3)-->
error
<!--07/05/22 (rel_2)-->
error
<!--07/05/21 (rel_1)-->
error
<!--rel_0-->
error
<!--07/05/19 rel_6-->
x
<!--rel_5-->
error
<!--rel_4-->
x
<!--rel_3-->
x
<!--rel_2-->
error
<!--rel_1-->
error
<!--rel_0-->
error
<!--rel_6-->
<!--rel_5-->
error
<!--rel_4-->
error
<!--rel_3-->
timedOut
val i686-slc4-gcc34-opt
<!-- Gen on the fly. single pi pt50GeV eta3.2 -->
<!--07/06/01 (rel_5)-->
5. operatorCloseDown
<!--07/05/31 (rel_4)-->
4. error
dev i686-slc4-gcc34-opt
<!-- Gen on the fly. single pi pt50GeV eta3.2 -->
<!--07/06/01 (rel_5)-->
5.
<!--07/05/31 (rel_4)-->
4. error
<!--07/05/30 (rel_3)-->
3. error
<!--07/05/29 (rel_2)-->
2. error
Read from file. mu_pt5_eta60 bugfix i686-slc4-gcc34-opt
<!--07/06/01 (rel_5)-->
5.
<!--07/05/31 (rel_4)-->
4. error
<!--07/05/30 (rel_3)-->
3. error
<!--07/05/29 (rel_2)-->
error
<!--07/05/28 (rel_1)-->
<!--07/05/27 (rel_0)-->
<!--07/05/26 (rel_6)-->
error
<!--07/05/25 (rel_5)-->
error
<!--07/05/24 (rel_4)-->
error
<!--07/05/23 (rel_3)-->
error
<!--07/05/22 (rel_2)-->
error
<!--07/05/21 (rel_1)-->
error
<!--rel_0-->
error
<!--rel_6-->
error
<!--rel_5-->
error
<!--rel_4-->
x
<!--rel_3-->
x
<!--rel_2-->
error
<!--rel_1-->
error
<!--rel_0-->
error
<!--rel_6-->
error
<!--rel_5-->
error
<!--rel_4-->
error
<!--rel_3-->
error
bugfix i686-slc3-gcc323-opt
<!-- Read from file. mu_pt5_eta60 -->
<!--07/06/01 (rel_5)-->
5.
<!--07/05/31 (rel_4)-->
4.
<!--07/05/30 (rel_3)-->
3.
<!--07/05/29 (rel_2)-->
2. error
<!--07/05/28 (rel_1)-->
<!--07/05/27 (rel_0)-->
<!--07/05/26 (rel_6)-->
error
<!--07/05/25 (rel_5)-->
error
<!--07/05/24 (rel_4)-->
error
<!--07/05/23 (rel_3)-->
error
<!--07/05/22 (rel_2)-->
x
<!--07/05/21 (rel_1)-->
error
<!--07/05/20 rel_0-->
x
<!--07/05/19 rel_6-->
x
<!--rel_5-->
error
<!--rel_4-->
x
<!--rel_3-->
x
<!--rel_2-->
x
<!--rel_1-->
error
<!--rel_0-->
error
<!--rel_6-->
error
<!--rel_5-->
error
<!--rel_4-->
error
<!--rel_3-->
error
val i686-slc4-gcc34-dbg
<!-- Read from file. mu_pt5_eta60 -->
<!--07/06/01 (rel_5)-->
5.
<!--07/05/31 (rel_4)-->
4.
<!--07/05/30 (rel_3)-->
3. error
<!--07/05/29 (rel_2)-->
2. error
<!--07/05/28 (rel_1)-->
<!--07/05/27 (rel_0)-->
<!--07/05/26 (rel_6)-->
error
<!--07/05/25 (rel_5)-->
error
<!--07/05/24 (rel_4)-->
error
<!--07/05/23 (rel_3)-->
error
<!--07/05/22 (rel_2)-->
error
<!--07/05/21 (rel_1)-->
success
<!--rel_0-->
error
<!--07/05/19 rel_6-->
x
<!--rel_5-->
error
<!--rel_4-->
x
<!--rel_3-->
x
<!--rel_2-->
error
<!--rel_1-->
error
<!--rel_0-->
error
<!--rel_6-->
<!--rel_5-->
error
<!--rel_4-->
error
<!--rel_3-->
error
val i686-slc4-gcc34-opt
<!-- Read from file. mu_pt5_eta60 -->
<!--07/06/01 (rel_5)-->
5. success
<!--07/05/31 (rel_4)-->
4. error
dev i686-slc4-gcc34-opt
<!-- Read from file. mu_pt5_eta60 -->
<!--07/06/01 (rel_5)-->
5.
<!--07/05/31 (rel_4)-->
4. error
<!--07/05/30 (rel_3)-->
3. batchError
<!--07/05/29 (rel_2)-->
2. error
Read from file. mu_pt50_eta30 bugfix i686-slc4-gcc34-opt
<!--07/06/01 (rel_5)-->
5.
<!--07/05/31 (rel_4)-->
4. error
<!--07/05/30 (rel_3)-->
3. error
<!--07/05/29 (rel_2)-->
error
<!--07/05/28 (rel_1)-->
<!--07/05/27 (rel_0)-->
<!--07/05/26 (rel_6)-->
error
<!--07/05/25 (rel_5)-->
success
<!--07/05/24 (rel_4)-->
error
<!--07/05/23 (rel_3)-->
error
<!--07/05/22 (rel_2)-->
error
<!--07/05/21 (rel_1)-->
error
<!--rel_0-->
error
<!--rel_6-->
error
<!--rel_5-->
error
<!--rel_4-->
x
<!--rel_3-->
x
<!--rel_2-->
error
<!--rel_1-->
success
<!--rel_0-->
error
<!--rel_6-->
error
<!--rel_5-->
error
<!--rel_4-->
error
<!--rel_3-->
error
bugfix i686-slc3-gcc323-opt
<!-- Read from file. mu_pt50_eta30 -->
<!--07/06/01 (rel_5)-->
5.
<!--07/05/31 (rel_4)-->
4.
<!--07/05/30 (rel_3)-->
3.
<!--07/05/29 (rel_2)-->
2. error
<!--07/05/28 (rel_1)-->
<!--07/05/27 (rel_0)-->
<!--07/05/26 (rel_6)-->
error
<!--07/05/25 (rel_5)-->
error
<!--07/05/24 (rel_4)-->
error
<!--07/05/23 (rel_3)-->
error
<!--07/05/22 (rel_2)-->
x
<!--07/05/21 (rel_1)-->
error
<!--07/05/20 rel_0-->
x
<!--07/05/19 rel_6-->
x
<!--rel_5-->
error
<!--rel_4-->
x
<!--rel_3-->
x
<!--rel_2-->
x
<!--rel_1-->
error
<!--rel_0-->
error
<!--rel_6-->
error
<!--rel_5-->
error
<!--rel_4-->
error
<!--rel_3-->
error
val i686-slc4-gcc34-dbg
<!-- Read from file. mu_pt50_eta30 -->
<!--07/06/01 (rel_5)-->
5.
<!--07/05/31 (rel_4)-->
4.
<!--07/05/30 (rel_3)-->
3. error
<!--07/05/29 (rel_2)-->
2. error
<!--07/05/28 (rel_1)-->
<!--07/05/27 (rel_0)-->
<!--07/05/26 (rel_6)-->
error
<!--07/05/25 (rel_5)-->
error
<!--07/05/24 (rel_4)-->
error
<!--07/05/23 (rel_3)-->
error
<!--07/05/22 (rel_2)-->
error
<!--07/05/21 (rel_1)-->
success
<!--rel_0-->
error
<!--07/05/19 rel_6-->
x
<!--rel_5-->
error
<!--rel_4-->
x
<!--rel_3-->
x
<!--rel_2-->
error
<!--rel_1-->
error
<!--rel_0-->
error
<!--rel_6-->
<!--rel_5-->
error
<!--rel_4-->
error
<!--rel_3-->
error
val i686-slc4-gcc34-opt
<!-- Read from file. mu_pt50_eta30 -->
<!--07/06/01 (rel_5)-->
5. success
<!--07/05/31 (rel_4)-->
4. success
dev i686-slc4-gcc34-opt
<!-- Read from file. mu_pt50_eta30 -->
<!--07/06/01 (rel_5)-->
5.
<!--07/05/31 (rel_4)-->
4. error
<!--07/05/30 (rel_3)-->
3. error
<!--07/05/29 (rel_2)-->
2. error
Read from file. e_pt5_eta60 bugfix i686-slc4-gcc34-opt
<!--07/06/01 (rel_5)-->
5.
<!--07/05/31 (rel_4)-->
4. error
<!--07/05/30 (rel_3)-->
3. error
<!--07/05/29 (rel_2)-->
error
<!--07/05/28 (rel_1)-->
<!--07/05/27 (rel_0)-->
<!--07/05/26 (rel_6)-->
error
<!--07/05/25 (rel_5)-->
error
<!--07/05/24 (rel_4)-->
error
<!--07/05/23 (rel_3)-->
error
<!--07/05/22 (rel_2)-->
success
<!--07/05/21 (rel_1)-->
error
<!--rel_0-->
error
<!--rel_6-->
error
<!--rel_5-->
success
<!--rel_4-->
x
<!--rel_3-->
x
<!--rel_2-->
error
<!--rel_1-->
error
<!--rel_0-->
error
<!--rel_6-->
error
<!--rel_5-->
error
<!--rel_4-->
error
<!--rel_3-->
error
bugfix i686-slc3-gcc323-opt
<!-- Read from file. e_pt5_eta60 -->
<!--07/06/01 (rel_5)-->
5.
<!--07/05/31 (rel_4)-->
4.
<!--07/05/30 (rel_3)-->
3.
<!--07/05/29 (rel_2)-->
2. error
<!--07/05/28 (rel_1)-->
<!--07/05/27 (rel_0)-->
<!--07/05/26 (rel_6)-->
error
<!--07/05/25 (rel_5)-->
error
<!--07/05/24 (rel_4)-->
error
<!--07/05/23 (rel_3)-->
error
<!--07/05/22 (rel_2)-->
x
<!--07/05/21 (rel_1)-->
error
<!--07/05/20 rel_0-->
x
<!--07/05/19 rel_6-->
x
<!--rel_5-->
error
<!--rel_4-->
x
<!--rel_3-->
x
<!--rel_2-->
x
<!--rel_1-->
success
<!--rel_0-->
error
<!--rel_6-->
success
<!--rel_5-->
error
<!--rel_4-->
error
<!--rel_3-->
error
val i686-slc4-gcc34-dbg
<!-- Read from file. e_pt5_eta60 -->
<!--07/06/01 (rel_5)-->
5.
<!--07/05/31 (rel_4)-->
4.
<!--07/05/30 (rel_3)-->
3. error
<!--07/05/29 (rel_2)-->
2. error
<!--07/05/28 (rel_1)-->
<!--07/05/27 (rel_0)-->
<!--07/05/26 (rel_6)-->
error
<!--07/05/25 (rel_5)-->
error
<!--07/05/24 (rel_4)-->
success
<!--07/05/23 (rel_3)-->
error
<!--07/05/22 (rel_2)-->
error
<!--07/05/21 (rel_1)-->
success
<!--rel_0-->
error
<!--07/05/19 rel_6-->
x
<!--rel_5-->
error
<!--rel_4-->
x
<!--rel_3-->
x
<!--rel_2-->
success
<!--rel_1-->
error
<!--rel_0-->
error
<!--rel_6-->
<!--rel_5-->
error
<!--rel_4-->
success
<!--rel_3-->
error
val i686-slc4-gcc34-opt
<!-- Read from file. e_pt5_eta60 -->
<!--07/06/01 (rel_5)-->
5. success
<!--07/05/31 (rel_4)-->
4. error
dev i686-slc4-gcc34-opt
<!-- Read from file. e_pt5_eta60 -->
<!--07/06/01 (rel_5)-->
5.
<!--07/05/31 (rel_4)-->
4. error
<!--07/05/30 (rel_3)-->
3. error
<!--07/05/29 (rel_2)-->
2. error
Read from file. e_pt50_eta25 bugfix i686-slc4-gcc34-opt
<!--07/06/01 (rel_5)-->
5.
<!--07/05/31 (rel_4)-->
4. error
<!--07/05/30 (rel_3)-->
3. error
<!--07/05/29 (rel_2)-->
error
<!--07/05/28 (rel_1)-->
<!--07/05/27 (rel_0)-->
<!--07/05/26 (rel_6)-->
success
<!--07/05/25 (rel_5)-->
success
<!--07/05/24 (rel_4)-->
error
<!--07/05/23 (rel_3)-->
error
<!--07/05/22 (rel_2)-->
success
<!--07/05/21 (rel_1)-->
error
<!--rel_0-->
error
<!--rel_6-->
error
<!--rel_5-->
error
<!--rel_4-->
x
<!--rel_3-->
x
<!--rel_2-->
error
<!--rel_1-->
success
<!--rel_0-->
timedOut
<!--rel_6-->
error
<!--rel_5-->
error
<!--rel_4-->
error
<!--rel_3-->
error
bugfix i686-slc3-gcc323-opt
<!-- Read from file. e_pt50_eta25 -->
<!--07/06/01 (rel_5)-->
5.
<!--07/05/31 (rel_4)-->
4.
<!--07/05/30 (rel_3)-->
3.
<!--07/05/29 (rel_2)-->
2. error
<!--07/05/28 (rel_1)-->
<!--07/05/27 (rel_0)-->
<!--07/05/26 (rel_6)-->
error
<!--07/05/25 (rel_5)-->
error
<!--07/05/24 (rel_4)-->
error
<!--07/05/23 (rel_3)-->
error
<!--07/05/22 (rel_2)-->
x
<!--07/05/21 (rel_1)-->
success
<!--07/05/20 rel_0-->
x
<!--07/05/19 rel_6-->
x
<!--rel_5-->
error
<!--rel_4-->
x
<!--rel_3-->
x
<!--rel_2-->
x
<!--rel_1-->
error
<!--rel_0-->
error
<!--rel_6-->
error
<!--rel_5-->
timedOut
<!--rel_4-->
error
<!--rel_3-->
success
val i686-slc4-gcc34-dbg
<!-- Read from file. e_pt50_eta25 -->
<!--07/06/01 (rel_5)-->
5.
<!--07/05/31 (rel_4)-->
4.
<!--07/05/30 (rel_3)-->
3. error
<!--07/05/29 (rel_2)-->
2. error
<!--07/05/28 (rel_1)-->
<!--07/05/27 (rel_0)-->
<!--07/05/26 (rel_6)-->
error
<!--07/05/25 (rel_5)-->
error
<!--07/05/24 (rel_4)-->
error
<!--07/05/23 (rel_3)-->
success
<!--07/05/22 (rel_2)-->
error
<!--07/05/21 (rel_1)-->
success
<!--rel_0-->
error
<!--07/05/19 rel_6-->
x
<!--rel_5-->
error
<!--rel_4-->
x
<!--rel_3-->
x
<!--rel_2-->
success
<!--rel_1-->
error
<!--rel_0-->
success
<!--rel_6-->
<!--rel_5-->
error
<!--rel_4-->
success
<!--rel_3-->
error
val i686-slc4-gcc34-opt
<!-- Read from file. e_pt50_eta25 -->
<!--07/06/01 (rel_5)-->
5. success
<!--07/05/31 (rel_4)-->
4. running
dev i686-slc4-gcc34-opt
<!-- Read from file. e_pt50_eta25 -->
<!--07/06/01 (rel_5)-->
5.
<!--07/05/31 (rel_4)-->
4. error
<!--07/05/30 (rel_3)-->
3. error
<!--07/05/29 (rel_2)-->
2. error
Read from file. pi_pt5_eta60 bugfix i686-slc4-gcc34-opt
<!--07/06/01 (rel_5)-->
5.
<!--07/05/31 (rel_4)-->
4. success >>
<!--07/05/30 (rel_3)-->
3. error
<!--07/05/29 (rel_2)-->
error
<!--07/05/28 (rel_1)-->
<!--07/05/27 (rel_0)-->
<!--07/05/26 (rel_6)-->
error
<!--07/05/25 (rel_5)-->
error
<!--07/05/24 (rel_4)-->
error
<!--07/05/23 (rel_3)-->
error
<!--07/05/22 (rel_2)-->
error
<!--07/05/21 (rel_1)-->
error
<!--rel_0-->
error
<!--rel_6-->
error
<!--rel_5-->
error
<!--rel_4-->
x
<!--rel_3-->
x
<!--rel_2-->
error
<!--rel_1-->
error
<!--rel_0-->
error
<!--rel_6-->
error
<!--rel_5-->
success
<!--rel_4-->
success
<!--rel_3-->
error
bugfix i686-slc3-gcc323-opt
<!-- Read from file. pi_pt5_eta60 -->
<!--07/06/01 (rel_5)-->
5.
<!--07/05/31 (rel_4)-->
4.
<!--07/05/30 (rel_3)-->
3.
<!--07/05/29 (rel_2)-->
2. error
<!--07/05/28 (rel_1)-->
<!--07/05/27 (rel_0)-->
<!--07/05/26 (rel_6)-->
error
<!--07/05/25 (rel_5)-->
error
<!--07/05/24 (rel_4)-->
error
<!--07/05/23 (rel_3)-->
error
<!--07/05/22 (rel_2)-->
x
<!--07/05/21 (rel_1)-->
error
<!--07/05/20 rel_0-->
x
<!--07/05/19 rel_6-->
x
<!--rel_5-->
error
<!--rel_4-->
x
<!--rel_3-->
x
<!--rel_2-->
x
<!--rel_1-->
success
<!--rel_0-->
error
<!--rel_6-->
error
<!--rel_5-->
error
<!--rel_4-->
error
<!--rel_3-->
error
val i686-slc4-gcc34-dbg
<!-- Read from file. pi_pt5_eta60 -->
<!--07/06/01 (rel_5)-->
5.
<!--07/05/31 (rel_4)-->
4.
<!--07/05/30 (rel_3)-->
3. error
<!--07/05/29 (rel_2)-->
2. success
<!--07/05/28 (rel_1)-->
<!--07/05/27 (rel_0)-->
<!--07/05/26 (rel_6)-->
error
<!--07/05/25 (rel_5)-->
error
<!--07/05/24 (rel_4)-->
error
<!--07/05/23 (rel_3)-->
error
<!--07/05/22 (rel_2)-->
error
<!--07/05/21 (rel_1)-->
success
<!--rel_0-->
timedOut
<!--07/05/19 rel_6-->
x
<!--rel_5-->
error
<!--rel_4-->
x
<!--rel_3-->
x
<!--rel_2-->
success
<!--rel_1-->
error
<!--rel_0-->
error
<!--rel_6-->
<!--rel_5-->
error
<!--rel_4-->
success
<!--rel_3-->
error
val i686-slc4-gcc34-opt
<!-- Read from file. pi_pt5_eta60 -->
<!--07/06/01 (rel_5)-->
5. success
<!--07/05/31 (rel_4)-->
4. success
dev i686-slc4-gcc34-opt
<!-- Read from file. pi_pt5_eta60 -->
<!--07/06/01 (rel_5)-->
5.
<!--07/05/31 (rel_4)-->
4. error
<!--07/05/30 (rel_3)-->
3. error
<!--07/05/29 (rel_2)-->
2. error
Read from file. pi_pt50_eta32 bugfix i686-slc4-gcc34-opt
<!--07/06/01 (rel_5)-->
5.
<!--07/05/31 (rel_4)-->
4. error >>
<!--07/05/30 (rel_3)-->
3. error
<!--07/05/29 (rel_2)-->
error
<!--07/05/28 (rel_1)-->
<!--07/05/27 (rel_0)-->
<!--07/05/26 (rel_6)-->
error
<!--07/05/25 (rel_5)-->
error
<!--07/05/24 (rel_4)-->
error
<!--07/05/23 (rel_3)-->
error
<!--07/05/22 (rel_2)-->
error
<!--07/05/21 (rel_1)-->
error
<!--rel_0-->
error
<!--rel_6-->
error
<!--rel_5-->
error
<!--rel_4-->
x
<!--rel_3-->
x
<!--rel_2-->
error
<!--rel_1-->
success
<!--rel_0-->
error
<!--rel_6-->
error
<!--rel_5-->
error
<!--rel_4-->
error
<!--rel_3-->
error
bugfix i686-slc3-gcc323-opt
<!-- Read from file. pi_pt50_eta32 -->
<!--07/06/01 (rel_5)-->
5.
<!--07/05/31 (rel_4)-->
4.
<!--07/05/30 (rel_3)-->
3.
<!--07/05/29 (rel_2)-->
2. success
<!--07/05/28 (rel_1)-->
<!--07/05/27 (rel_0)-->
<!--07/05/26 (rel_6)-->
error
<!--07/05/25 (rel_5)-->
error
<!--07/05/24 (rel_4)-->
error
<!--07/05/23 (rel_3)-->
error
<!--07/05/22 (rel_2)-->
x
<!--07/05/21 (rel_1)-->
error
<!--07/05/20 rel_0-->
x
<!--07/05/19 rel_6-->
x
<!--rel_5-->
error
<!--rel_4-->
x
<!--rel_3-->
x
<!--rel_2-->
x
<!--rel_1-->
error
<!--rel_0-->
success
<!--rel_6-->
error
<!--rel_5-->
error
<!--rel_4-->
error
<!--rel_3-->
error
val i686-slc4-gcc34-dbg
<!-- Read from file. pi_pt50_eta32 -->
<!--07/06/01 (rel_5)-->
5.
<!--07/05/31 (rel_4)-->
4.
<!--07/05/30 (rel_3)-->
3. success
<!--07/05/29 (rel_2)-->
2. error
<!--07/05/28 (rel_1)-->
<!--07/05/27 (rel_0)-->
<!--07/05/26 (rel_6)-->
error
<!--07/05/25 (rel_5)-->
success
<!--07/05/24 (rel_4)-->
error
<!--07/05/23 (rel_3)-->
error
<!--07/05/22 (rel_2)-->
error
<!--07/05/21 (rel_1)-->
success
<!--rel_0-->
error
<!--07/05/19 rel_6-->
x
<!--rel_5-->
error
<!--rel_4-->
x
<!--rel_3-->
x
<!--rel_2-->
success
<!--rel_1-->
error
<!--rel_0-->
error
<!--rel_6-->
<!--rel_5-->
error
<!--rel_4-->
error
<!--rel_3-->
error
val i686-slc4-gcc34-opt
<!-- Read from file. pi_pt50_eta32 -->
<!--07/06/01 (rel_5)-->
5. success >>
<!--07/05/31 (rel_4)-->
4. success
dev i686-slc4-gcc34-opt
<!-- Read from file. pi_pt50_eta32 -->
<!--07/06/01 (rel_5)-->
5.
<!--07/05/31 (rel_4)-->
4. error >>
<!--07/05/30 (rel_3)-->
3. error
<!--07/05/29 (rel_2)-->
2. error
Tests detector functionality using G4AtlasTests bugfix i686-slc4-gcc34-opt
<!--07/06/01 (rel_5)-->
5.
<!--07/05/31 (rel_4)-->
4. success
<!--07/05/30 (rel_3)-->
3. success
<!--07/05/29 (rel_2)-->
success
<!--07/05/28 (rel_1)-->
<!--07/05/27 (rel_0)-->
<!--07/05/26 (rel_6)-->
success
<!--07/05/25 (rel_5)-->
success
<!--07/05/24 (rel_4)-->
success
<!--07/05/23 (rel_3)-->
success
<!--07/05/22 (rel_2)-->
error
<!--07/05/21 (rel_1)-->
success
<!--rel_0-->
success
<!--rel_6-->
success
<!--rel_5-->
success
<!--rel_4-->
x
<!--rel_3-->
x
<!--rel_2-->
success
<!--rel_1-->
success
<!--rel_0-->
success
<!--rel_6-->
error
<!--rel_5-->
success
<!--rel_4-->
success
<!--rel_3-->
success
bugfix i686-slc3-gcc323-opt
<!-- Tests detector functionality using G4AtlasTests -->
<!--07/06/01 (rel_5)-->
5.
<!--07/05/31 (rel_4)-->
4.
<!--07/05/30 (rel_3)-->
3.
<!--07/05/29 (rel_2)-->
2. success
<!--07/05/28 (rel_1)-->
<!--07/05/27 (rel_0)-->
<!--07/05/26 (rel_6)-->
success
<!--07/05/25 (rel_5)-->
error
<!--07/05/24 (rel_4)-->
error
<!--07/05/23 (rel_3)-->
error
<!--07/05/22 (rel_2)-->
x
<!--07/05/21 (rel_1)-->
success
<!--rel_0-->
x
<!--rel_6-->
success
<!--rel_5-->
success
<!--rel_4-->
x
<!--rel_3-->
x
<!--rel_2-->
x
<!--rel_1-->
success
<!--rel_0-->
success
<!--rel_6-->
success
<!--rel_5-->
success
<!--rel_4-->
error
<!--rel_3-->
success
val i686-slc4-gcc34-dbg
<!-- Tests detector functionality using G4AtlasTests -->
<!--07/06/01 (rel_5)-->
5.
<!--07/05/31 (rel_4)-->
4.
<!--07/05/30 (rel_3)-->
3. success
<!--07/05/29 (rel_2)-->
2. success
<!--07/05/28 (rel_1)-->
<!--07/05/27 (rel_0)-->
<!--07/05/26 (rel_6)-->
success
<!--07/05/25 (rel_5)-->
error
<!--07/05/24 (rel_4)-->
error
<!--07/05/23 (rel_3)-->
success
<!--07/05/22 (rel_2)-->
success
<!--07/05/21 (rel_1)-->
success
<!--rel_0-->
success
<!--07/05/19 rel_6-->
x
<!--rel_5-->
success
<!--rel_4-->
x
<!--rel_3-->
x
<!--rel_2-->
success
<!--rel_1-->
success
<!--rel_0-->
success
<!--rel_6-->
<!--rel_5-->
success
<!--rel_4-->
success
<!--rel_3-->
success
val i686-slc4-gcc34-opt
<!-- Tests detector functionality using G4AtlasTests -->
<!--07/06/01 (rel_5)-->
5. success
<!--07/05/31 (rel_4)-->
4. success
dev i686-slc4-gcc34-opt
<!-- Tests detector functionality using G4AtlasTests -->
<!--07/06/01 (rel_5)-->
5.
<!--07/05/31 (rel_4)-->
4. error >>
<!--07/05/30 (rel_3)-->
3. error
<!--07/05/29 (rel_2)-->
2. error
SimuJobTransforms
bugfix i686-slc4-gcc34-opt
<!--07/06/01 (rel_5)-->
5.
<!--07/05/31 (rel_4)-->
4. 3/0/0
<!--07/05/30 (rel_3)-->
3. 3/0/0
<!--07/05/29 (rel_2)-->
2. 3/1/0
<!--07/05/28 (rel_1)-->
1. x
<!--07/05/27 (rel_0)-->
0. x
<!--07/05/26 (rel_6)-->
6. 3/0/0
<!--07/05/25 (rel_5)-->
5. 3/0/0
<!--07/05/24 (rel_4)-->
4. 1/1/0
<!--07/05/23 (rel_3)-->
3. 1/1/0
<!--07/05/22 (rel_2)-->
2. 1/1/0
bugfix i686-slc3-gcc323-opt
<!--07/06/01 (rel_5)-->
5.
<!--07/05/31 (rel_4)-->
4.
<!--07/05/30 (rel_3)-->
3.
<!--07/05/29 (rel_2)-->
2. 3/0/0
<!--07/05/28 (rel_1)-->
1. x
<!--07/05/27 (rel_0)-->
0. x
<!--07/05/26 (rel_6)-->
6. 3/1/0
<!--07/05/25 (rel_5)-->
5. 3/1/0
<!--07/05/24 (rel_4)-->
4. 1/1/0
<!--07/05/23 (rel_3)-->
3. 1/1/0
<!--07/05/22 (rel_2)-->
2. x
val i686-slc4-gcc34-opt
<!--07/06/01 (rel_5)-->
5. 3/0/0
<!--07/05/31 (rel_4)-->
4. 3/0/0
val i686-slc4-gcc34-dbg
<!--07/06/01 (rel_5)-->
5.
<!--07/05/31 (rel_4)-->
4.
<!--07/05/30 (rel_3)-->
3. 3/1/0
<!--07/05/29 (rel_2)-->
2. 3/0/0
<!--07/05/28 (rel_1)-->
1. x
<!--07/05/27 (rel_0)-->
0. x
<!--07/05/26 (rel_6)-->
6. 3/0/0
<!--07/05/25 (rel_5)-->
5. 3/0/0
<!--07/05/24 (rel_4)-->
4. 1/1/1
<!--07/05/23 (rel_3)-->
3. 1/1/0
<!--07/05/22 (rel_2)-->
2. 1/1/0
dev i686-slc4-gcc34-opt
<!--07/06/01 (rel_5)-->
5.
<!--07/05/31 (rel_4)-->
4. 3/1/0
<!--07/05/30 (rel_3)-->
3. 3/1/0
<!--07/05/29 (rel_2)-->
2. 3/1/0
Shower parameterization test bugfix i686-slc4-gcc34-opt
<!--07/06/01 (rel_5)-->
5.
<!--07/05/31 (rel_4)-->
4. job:batchError
<!--07/05/30 (rel_3)-->
3. job:timedOut
<!--07/05/29 (rel_2)-->
job:timedOut
<!--07/05/28 (rel_1)-->
<!--07/05/27 (rel_0)-->
<!--07/05/26 (rel_6)-->
job:timedOut test:unavailable
<!--07/05/25 (rel_5)-->
job:timedOut test:unavailable
bugfix i686-slc3-gcc323-opt
<!--07/06/01 (rel_5)-->
5.
<!--07/05/31 (rel_4)-->
4.
<!--07/05/30 (rel_3)-->
3.
<!--07/05/29 (rel_2)-->
2. job:timedOut
<!--07/05/28 (rel_1)-->
<!--07/05/27 (rel_0)-->
<!--07/05/26 (rel_6)-->
6. job:timedOut
<!--07/05/25 (rel_5)-->
5. job:timedOut
val i686-slc4-gcc34-dbg
<!--Shower parameterization test-->
<!--07/06/01 (rel_5)-->
5.
<!--07/05/31 (rel_4)-->
4.
<!--07/05/30 (rel_3)-->
3. job:timedOut
<!--07/05/29 (rel_2)-->
2. job:timedOut
<!--07/05/28 (rel_1)-->
<!--07/05/27 (rel_0)-->
<!--07/05/26 (rel_6)-->
6. job:timedOut
<!--07/05/25 (rel_5)-->
5. job:timedOut
val i686-slc4-gcc34-opt
<!--Shower parameterization test-->
<!--07/06/01 (rel_5)-->
5. operatorCloseDown
<!--07/05/31 (rel_4)-->
4. job:timedOut
dev i686-slc4-gcc34-opt
<!--Shower parameterization test-->
<!--07/06/01 (rel_5)-->
5.
<!--07/05/31 (rel_4)-->
4.
<!--07/05/30 (rel_3)-->
3. job:timedOut
<!--07/05/29 (rel_2)-->
2. job:timedOut
Single particle sample bugfix i686-slc4-gcc34-opt
<!--07/06/01 (rel_5)-->
5.
<!--07/05/31 (rel_4)-->
4. job:timedOut
<!--07/05/30 (rel_3)-->
3. job:timedOut
<!--07/05/29 (rel_2)-->
job:timedOut
<!--07/05/28 (rel_1)-->
<!--07/05/27 (rel_0)-->
<!--07/05/26 (rel_6)-->
job:timedOut test:unavailable
<!--07/05/25 (rel_5)-->
job:timedOut test:unavailable
bugfix i686-slc3-gcc323-opt
<!--07/06/01 (rel_5)-->
5.
<!--07/05/31 (rel_4)-->
4.
<!--07/05/30 (rel_3)-->
3.
<!--07/05/29 (rel_2)-->
2. job:timedOut
<!--07/05/28 (rel_1)-->
<!--07/05/27 (rel_0)-->
<!--07/05/26 (rel_6)-->
6. job:timedOut
<!--07/05/25 (rel_5)-->
5. job:timedOut
val i686-slc4-gcc34-dbg
<!--Single particle sample-->
<!--07/06/01 (rel_5)-->
5.
<!--07/05/31 (rel_4)-->
4.
<!--07/05/30 (rel_3)-->
3. job:timedOut
<!--07/05/29 (rel_2)-->
2. job:timedOut
<!--07/05/28 (rel_1)-->
<!--07/05/27 (rel_0)-->
<!--07/05/26 (rel_6)-->
6. job:timedOut
<!--07/05/25 (rel_5)-->
5. job:timedOut
val i686-slc4-gcc34-opt
<!--Single particle sample-->
<!--07/06/01 (rel_5)-->
5. operatorCloseDown
<!--07/05/31 (rel_4)-->
4. job:timedOut
dev i686-slc4-gcc34-opt
<!--Single particle sample-->
<!--07/06/01 (rel_5)-->
5.
<!--07/05/31 (rel_4)-->
4.
<!--07/05/30 (rel_3)-->
3. job:timedOut
<!--07/05/29 (rel_2)-->
2. job:timedOut
T1_McAtNlo_Jimmy bugfix i686-slc4-gcc34-opt
<!--07/06/01 (rel_5)-->
5.
<!--07/05/31 (rel_4)-->
4. job:error
<!--07/05/30 (rel_3)-->
3. job:error
<!--07/05/29 (rel_2)-->
job:success test:error
<!--07/05/28 (rel_1)-->
<!--07/05/27 (rel_0)-->
<!--07/05/26 (rel_6)-->
job:error test:no tests
<!--07/05/25 (rel_5)-->
job:error test:no tests
<!-- 5/24 rel_4 -->
4. job:success test:error
<!-- 5/23 rel_3 -->
3. job:success test:error
<!-- 5/22 rel_2 -->
2. job:success test:error
<!-- 5/21 rel_1 -->
1. job:success test:error
<!-- 5/20 rel_0 -->
0. job:success test:error >>
bugfix i686-slc3-gcc323-opt
<!--07/06/01 (rel_5)-->
5.
<!--07/05/31 (rel_4)-->
4.
<!--07/05/30 (rel_3)-->
3.
<!--07/05/29 (rel_2)-->
2. job:error test:no tests
<!--07/05/28 (rel_1)-->
<!--07/05/27 (rel_0)-->
<!--07/05/26 (rel_6)-->
6. job:success test:error
<!--07/05/25 (rel_5)-->
5. job:success test:error
<!-- 5/24 rel_4 -->
4. job:success test:error
<!-- 5/23 rel_3 -->
3. job:success test:error
<!-- 5/22 rel_2 -->
x
<!-- 5/21 rel_1 -->
1. job:success test:error
<!-- 5/20 rel_0 -->
0. job:success test:error >>
val i686-slc4-gcc34-dbg
<!--T1_McAtNlo_Jimmy-->
<!--07/06/01 (rel_5)-->
5.
<!--07/05/31 (rel_4)-->
4.
<!--07/05/30 (rel_3)-->
3. job:success test:error
<!--07/05/29 (rel_2)-->
2. job:error test:no tests
<!--07/05/28 (rel_1)-->
<!--07/05/27 (rel_0)-->
<!--07/05/26 (rel_6)-->
6. job:error test:no tests
<!--07/05/25 (rel_5)-->
5. job:error test:no tests
<!-- 5/24 rel_4 -->
4. job:success test:success
<!-- 5/23 rel_3 -->
3. job:success test:error
<!-- 5/22 rel_2 -->
2. job:success test:error
<!-- 5/21 rel_1 -->
1. job:success test:error
<!-- 5/20 rel_0 -->
0. job:success test:error >>
<!-- 5/19 rel_6 -->
6. job:success test:error
<!-- 5/18 rel_5 -->
5. job:success test:error
<!--rel_4-->
4. x
<!--rel_3-->
3. x
<!--rel_2-->
<!--rel_1-->
<!--rel_0-->
<!--rel_6-->
<!--rel_5-->
<!--rel_4-->
<!--rel_3-->
<!--rel_2-->
<!--rel_6-->
val i686-slc4-gcc34-opt
<!--T1_McAtNlo_Jimmy-->
<!--07/06/01 (rel_5)-->
5. job:error
<!--07/05/31 (rel_4)-->
4. job:error
dev i686-slc4-gcc34-opt
<!--T1_McAtNlo_Jimmy-->
<!--07/06/01 (rel_5)-->
5.
<!--07/05/31 (rel_4)-->
4.
<!--07/05/30 (rel_3)-->
3. job:success test:error
<!--07/05/29 (rel_2)-->
2. job:success test:error


#RTT
Branch Platform
bugfix i686-slc4-gcc34-opt
Release Started Completed Total RTT Jobs OK Package DoneJobs/JobsOK/TestsOK Package DoneJobs/JobsOK/TestsOK
rel_1 07/06/04@10:01 07/06/04@18:32 149 G4AtlasApps-00-02-03-02 16/8/0 SimuJobTransforms-00-07-20 3/0/0
rel_0 07/06/03@10:00 07/06/03@18:11 164 G4AtlasApps-00-02-03-02 16/8/0 G4AtlasApps-00-02-03-02 3/0/0
rel_6 07/06/02@10:01 n/a 166 G4AtlasApps-00-02-03-02 16/8/0 SimuJobTransforms-00-07-20 3/0/0
rel_5 07/06/01@10:00 07/06/01@18:13 36
rel_4 07/05/31@10:01 07/05/31@18:38 153 G4AtlasApps-00-02-03-02 16/8/0 SimuJobTransforms-00-07-20 3/0/0 24 jobs with batch errors. 1 SimuJobTransform job timed out.
rel_3 07/05/30@10:00 07/05/30@20:25 163 G4AtlasApps-00-02-03-02 16/8/0 SimuJobTransforms-00-07-20 3/0/0 2 TestAtlfast jobs aborted, 2 SimuJobTransforms, 1 RecExRecoTest job timed out
rel_2 07/05/29@16:01 07/05/30@06:00 148 G4AtlasApps-00-02-03-02 16/8/0 SimuJobTransforms-00-07-20 3/1/0
rel_1 07/05/28       Disk quota full: run killed on startup.
rel_0 07/05/27@13:00 n/a 140     Disk quota full:process killed
rel_6 07/05/26@13:00 07/05/26@22:22 110 G4AtlasApps-00-02-03-02 15/8/0 SimuJobTransforms-00-07-20 3/0/0 2 SimuJobTransforms jobs timed out
rel_5 07/05/25@13:31 07/05/26@13:06 105 G4AtlasApps-00-02-03-01 15/10/0 SimuJobTransforms-00-07-20 3/0/0 2 SimuJobTransforms jobs timed out
rel_4 07/05/24@12:30 n/a 100 G4AtlasApps-00-02-03-01 15/7/0 SimuJobTransforms-00-07-19 1/1/0 1 TrigEgammaValidation job still in queue
rel_3 07/05/23@12:30 07/05/24@06:37 104 G4AtlasApps-00-02-03-01 15/8/0 SimuJobTransforms-00-07-19 1/1/0 43 TestAltfast jobs Brinick-aborted
rel_2 07/05/22@16:31 07/05/23@05:50 81 G4AtlasApps-00-02-03-01 15/6/0 SimuJobTransforms-00-07-19 1/1/0
rel_1 07/05/21@16:30 07/05/22@08:28 84 G4AtlasApps-00-02-03-01 15/5/0 SimuJobTransforms-00-07-19 1/1/0 Many jobs lost in package TestAtlfast due to unexpected batch response.
rel_0 07/05/20@12:31 07/05/20@18:15 79 G4AtlasApps-00-02-03-01 15/5/0   Disk space problems that affected 2 CaloRecEx jobs (and prevented correct RTT close down)
rel_6 07/05/19@09:25 07/05/19@17:29 83 G4AtlasApps-00-02-03-01 15/8/0   3 jobs timed out (CaloRecEx, Digitization, MboyPerformance).
rel_5 07/05/18@09:25 07/05/18@22:17 95 G4AtlasApps-00-02-02 15/8/0   1 CaloRecEx job timed out.
rel_4 07/05/17@10:35 07/05/17@16:00 9 G4AtlasApps-00-02-02 15/0/0   Disk space filled up: run should be ignored.
rel_3 07/05/16@21:50 07/05/17@10:01 26 G4AtlasApps-00-02-02 15/2/0   Disk space filled up: many jobs affected.
rel_2 07/05/15@10:11 07/05/16@06:19 93 G4AtlasApps-00-02-02 15/8/0
rel_1 07/05/14@08:10 n/a 89
rel_0 07/05/13@10:45 07/05/14@07:42 93 15 8 n/a
rel_6 07/05/12@11:30 07/05/13@10:25 70
rel_5 07/05/11@09:30 07/05/12@08:44 85
rel_4 07/05/10@16:00 07/05/11@06:24 93 15 8 n/a
rel_3 07/05/09@09:10 07/05/10@07:44 84
rel_2 07/05/08@10:40 07/05/08@21:05 57

#RTT

Branch Platform
bugfix i686-slc3-gcc323-opt
Release Started Completed Total RTT Jobs OK Package DoneJobs/JobsOK/TestsOK Package DoneJobs/JobsOK/TestsOK
rel_2 07/05/29@20:00 07/05/30@04:31 174 G4AtlasApps-00-02-03-02 16/11/0 SimuJobTransforms-00-07-20 3/0/0 1 Calo job with batch error, 2 SimuJobTransforms jobs timed out
rel_1 07/05/28       Disk quota full: run killed on startup.
rel_0 07/05/27 --- ---     No NICOS build.
rel_6 07/05/26@18:00 n/a 94 G4AtlasApps-00-02-03-02 16/11/5/0 SimuJobTransforms-00-07-20 3/1/0 job success rate improved considerably; process killed
rel_5 07/05/25@17:30 n/a 60 G4AtlasApps-00-02-03-01 15/0/0 SimuJobTransforms-00-07-20 3/1/0 problem with results pages, investigating
rel_4 07/05/24@19:00 07/05/25@18:35 58 G4AtlasApps-00-02-03-01 15/0/0 SimuJobTransforms-00-07-19 1/1/0
rel_3 07/05/23@19:00 07/05/24@06:05 61 G4AtlasApps-00-02-03-01 15/0/0 SimuJobTransforms-00-07-19 1/1/0
rel_2 --- --- ---     No NICOS build.
rel_1 07/05/21@19:01 07/05/22@05:42 93 G4AtlasApps-00-02-03-01 15/8/0 SimuJobTransforms-00-07-19 1/1/0 4 jobs timed out (1 RecExRecoTest, CaloRecEx, Digitization, G4AtlasApps)
rel_0 07/05/20@18:00 07/05/21@05:42 9 G4AtlasApps-00-02-03-01 15/15 0/15 0/0   DQ reported on HyperNews that the build was corrupt.
rel_6 07/05/19@18:01 n/a 78 G4AtlasApps-00-02-03-01 15/15 8/15 0/8   Many jobs timed out: please ignore run.
rel_5 07/05/18@19:31 07/05/19@09:51 85 G4AtlasApps-00-02-02 15/15 7/15 0/7   2 jobs timed out (Digitization: batch system responded unusually; G4AtlasApps).
rel_4 07/05/17@19:30 07/05/18@06:36 15 G4AtlasApps-00-02-02 15/15 0/15 0/0   Disk space filled up: run should be ignored.
rel_3 07/05/16@20:30 07/05/17@10:19 49 G4AtlasApps-00-02-02 15/15 1/15 0/1   Disk space filled up: many jobs affected.
rel_2 07/05/15@16:00 07/05/16@06:56 9 G4AtlasApps-00-02-02 15/15 0/15 0/0   Massive failure: ApplicationMgr WARNING Failed to load modules: AthenaServices
--- --- --- --- --- --- ---
rel_0 07/05/13@18:01 07/05/14@07:36 91
rel_6 07/05/12@17:25 07/05/13@10:14 63
rel_5 07/05/11@14:30 07/05/12@08:35 76
rel_4 07/05/10@21:04 07/05/11@06:17 58
rel_3 07/05/09@15:31 07/05/10@07:29 57
--- --- --- --- --- --- ---
rel_4 07/05/10@21:04 07/05/11@06:17   15 15 1 n/a

#RTT

Branch Platform
val i686-slc4-gcc34-opt
Release Started Completed Total RTT Jobs OK Package DoneJobs/JobsOK/TestsOK Package DoneJobs/JobsOK/TestsOK
rel_1 07/06/04@11:00 07/06/04@20:09 164 G4AtlasApps-00-02-03-02 16/7/0 SimuJobTransforms-00-07-20 3/0/0
rel_0 07/06/03@07:00 07/06/03@15:49 166 G4AtlasApps-00-02-03-02 16/7/0 SimuJobTransforms-00-07-20 3/0/0
rel_6 07/06/02@07:00 07/06/03@07:02 163 G4AtlasApps-00-02-03-02 16/7/0 SimuJobTransforms-00-07-20 3/0/0
rel_5 07/06/01@07:01 07/06/01@07:54 26 G4AtlasApps-00-02-03-02 16/10/0 SimuJobTransforms-00-07-20 3/0/0 Build:Bad; Build corrupt: David Q. advises to ignore run.
rel_4 07/05/31@07:01 n/a 167 G4AtlasApps-00-02-03-02 16/14/9/0 SimuJobTransforms-00-07-20 3/0/0 AFS:Bad;RTT:Bad;Failed to shut down properly (AFS problem?): 1 MboyPerformance job affected.

Branch Platform
val i686-slc4-gcc34-dbg
Release Started Completed Total RTT Jobs OK Package DoneJobs/JobsOK/TestsOK Package DoneJobs/JobsOK/TestsOK
rel_5 07/06/01@07:01 07/06/01@07:54 26
rel_4 --
rel_3 07/05/30@07:00 07/05/30@19:17 158 G4AtlasApps-00-02-03-02 16/9/0 SimuJobTransforms-00-07-20 3/1/0 2 SimuJobTransforms, 1 InDetRTT, 1 egammaRec job timed out
rel_2 07/05/29@09:01 07/05/29@23:02 159 G4AtlasApps-00-02-03-02 16/7/0 SimuJobTransforms-00-07-20 3/0/0 1 Atlfast and 2 SimuJobTransforms jobs timed out
rel_1 07/05/28       Disk quota full: run killed on startup.
rel_0 07/05/27@09:01 n/a 113     disk quota full: process killed
rel_6 07/05/26@09:00 n/a 102 G4AtlasApps-00-02-03-02 16/15/7/0 SimuJobTransforms-00-07-20 3/0/0 2 SimuJobTransforms jobs timed out; process killed
rel_5 07/05/25@09:30 07/05/26@09:04 108 G4AtlasApps-00-02-03-02 16/8/0 SimuJobTransforms-00-07-20 3/0/0 4 jobs timed out and 56 were closed down by RTT
rel_4 07/05/24@07:01 07/05/24@20:41 101 G4AtlasApps-00-02-03-01 15/7/0 SimuJobTransforms-00-07-19 1/1/1
rel_3 >> 07/05/23@08:11 07/05/23@19:05 105 G4AtlasApps-00-02-03-01 15/9/0 SimuJobTransforms-00-07-19 1/1/0
rel_2 07/05/22@13:10 07/05/22@16:13 89 G4AtlasApps-00-02-03-01 15/4/0 >> SimuJobTransforms-00-07-19 1/1/0
rel_1 07/05/21@13:01 07/05/22@05:41 74 G4AtlasApps-00-02-03-01 15/15 13/15 0/13 SimuJobTransforms-00-07-19 1/1 1/1 0/1 11 jobs timed out (6 TestAtlfast, 1 CaloRecEx/CaloDigEx/CaloTests/G4AtlasApps/TrigInDetValidation); 24 jobs (13 TestAtlfast, 11 TriggerTest) fail with batch errors ("Failed in an LSF library call: Slave LIM configuration is not ready yet")
rel_0 07/05/20@09:00 07/05/20@20:04 87 G4AtlasApps-00-02-03-01 15/15 8/15 0/8   1 G4AtlasApps job timed out (stange batch system response)
rel_6 07/05/19@14:20 07/05/20@08:28 9 G4AtlasApps-00-02-03-01 15/15 0/15 0/0   DQ reported on HyperNews that the build was corrupt.
rel_5 07/05/18@14:05 07/05/19@09:46 87 G4AtlasApps-00-02-03-01 15/15 8/15 0/8
rel_4 07/05/17@13:30 07/05/18@06:38 35 G4AtlasApps-00-02-03-01 15/15 2/15 0/2   Disk space filled up: run should be ignored.
rel_3 07/05/16@19:06 07/05/17@09:39 50 G4AtlasApps-00-02-03-01 15/15 0/15 0/0   Disk space filled up: many jobs affected.
rel_2 07/05/15@06:36 07/05/16@06:11 59 G4AtlasApps-00-02-02 15/15 12/15 0/12   10 jobs timed out: batch system replied in an RTT unexpected manner.
rel_1 07/05/14@11:31 07/05/15@06:30 83 G4AtlasApps-00-02-02 15/15 7/15 0/7
rel_0 07/05/13@14:01 07/05/14@07:33 85 G4AtlasApps-00-02-02 15/15 9/15 0/9
rel_5 07/05/11@06:50 n/a 80
rel_4 07/05/10@17:30 07/05/11@06:19 83
rel_3 07/05/09@12:00 07/05/10@06:57 83
rel_2 07/05/08@12:41 07/05/08@20:38 39

#RTT

Branch Platform
dev i686-slc4-gcc34-opt
Release Started Completed Total RTT Jobs OK Package DoneJobs/JobsOK/TestsOK Package DoneJobs/JobsOK/TestsOK
rel_1 07/06/04@15:01 07/06/04@19:28 98 G4AtlasApps-00-02-05 16/0/0 SimuJobTransforms-00-07-20 3/0/0
rel_0 07/06/03@13:00 07/06/03@15:47 109 G4AtlasApps-00-02-05 16/0/0 SimuJobTransforms-00-07-20 3/1/0
rel_6 07/06/02@13:00 07/06/02@15:50 107 G4AtlasApps-00-02-05 16/0/0 SimuJobTransforms-00-07-20 3/1/0
rel_5 07/06/01@13:01 07/06/01@22:04 35
rel_4 07/05/31@13:00 07/05/31@16:25 9 G4AtlasApps-00-02-05 16/0/0 SimuJobTransforms-00-07-20 3/1/0 Build:Bad; Paolo C. put out a message that the build was corrupt.
rel_3 07/05/30@13:01 n/a 100 G4AtlasApps-00-02-05 16/1/0 SimuJobTransforms-00-07-20 3/1/0 RTT:Bad; 2 SimuJobTransforms timed out, 1 PixelRTT job aborted. RTT automatic shut down did not work properly.
rel_2 07/05/29@13:00 07/05/29@17:13 104 G4AtlasApps-00-02-05 16/1/0 SimuJobTransforms-00-07-20 3/1/0 2 SimuJobTransforms jobs timed out

Release Started Completed Total RTT Jobs OK Package Done Jobs Jobs OK Tests OK
rel_0 07/05/13@14:01 07/05/14@07:33 85 G4AtlasApps-00-02-02 15/15 9/15 0/9
Name Description Datasets Job Combined Checks ... CPU time CPU time 2000 Walltime Memory V-Memory
test_ATLAS_GeoTest436 Recursive geometry test. Done only on G4 and geomodel envelopes n/a success no tests
test_ATLAS_Template438 Gen on the fly. single-e-pt50-eta2.5 n/a success no tests   21343 s 57323 s 23775 s 1MB 105MB atlasrttlong: 72 KSI2K hours = 4320 m = 259200 s
test_ATLAS_Template440 Gen on the fly. single-mu-pt100-eta3.0 n/a success no tests   1921 s 5159 s 3099 s 1MB 105MB atlasrttlong
test_ATLAS_Template442 Gen on the fly. single-pi-pt50-eta5.0 n/a success no tests   33303 s 89444 s 35088 s 592MB 930MB atlasrttlong
test_ATLAS_Template444 Read from file. T1_McAtNlo_Jimmy csc11.005200.T1_McAtNlo_Jimmy.evgen.EVNT.v11000401._00001.pool.root
  success no tests
test_ATLAS_Template446 Gen on the fly. single e pt50GeV eta2.5 n/a success no tests 21985 s 59047 s 24436 s 567MB 905MB atlasrttlong
test_ATLAS_Template448 Gen on the fly. single mu pt50GeV eta3.0 n/a success no tests 671 s 1802 s 1696 s 1MB 105MB atlasrttmedium
test_ATLAS_Template450 Gen on the fly. single pi pt50GeV eta3.2 n/a error no tests GenEvent: #212, /afs/cern.ch/atlas/project/RTT/Work/rel_0/val/build/i686-slc4-gcc34-dbg/G4AtlasApps/AthenaG4AtlasApps/test_ATLAS_Template/450/runScript.sh: line 29: 19488 Killed /afs/cern.ch/atlas/project/RTT/Work/rel_0/val/build/i686-slc4-gcc34-dbg/EvgenJobTransforms/JobTransform/5101.JimmyWmunu/207/LSFJOB_1160049/STDERR 12868 s 34561 s 14180 s 567MB 905MB atlasrttmedium: 8 KSI2K hours = 480 min = 28800 s
test_ATLAS_Template452 Read from file. mu_pt5_eta60 test.009996.evgen.mu_pt5_eta60._0001.pool.root error no tests beginOfRun , FATAL 2007-May-13 16:35:49 [static void ers::ErrorHandler::SignalHandler::action(int, siginfo_t*, void*) at ers/src/ErrorHandler.cxx:88] Got signal 11 Segmentation fault (invalid memory reference) #0 ers::LocalContext::LocalContext(char const*, char const*, int, char const*) from /afs/cern.ch/atlas/project/tdaq/cmt/tdaq-common/tdaq-common-01-06-01/installed/i686-slc4-gcc34-dbg/lib/libers.so /afs/cern.ch/atlas/project/RTT/Work/rel_0/val/build/i686-slc4-gcc34-dbg/EvgenJobTransforms/JobTransform/5200.T1_McAtNlo_Jimmy/209/LSFJOB_1160053/STDERR
test_ATLAS_Template454 Read from file. mu_pt50_eta30 test.009999.evgen.mu_pt50_eta30._0001.pool.root error no tests beginOfRun , FATAL 2007-May-13 16:35:13 [static void ers::ErrorHandler::SignalHandler::action(int, siginfo_t*, void*) at ers/src/ErrorHandler.cxx:88] Got signal 11 Segmentation fault (invalid memory reference) #0 ers::LocalContext::LocalContext(char const*, char const*, int, char const*) from /afs/cern.ch/atlas/project/tdaq/cmt/tdaq-common/tdaq-common-01-06-01/installed/i686-slc4-gcc34-dbg/lib/libers.so /afs/cern.ch/atlas/project/RTT/Work/rel_0/val/build/i686-slc4-gcc34-dbg/EvgenJobTransforms/JobTransform/5200.T1_McAtNlo_Jimmy/209/LSFJOB_1160056/STDERR
test_ATLAS_Template458 Read from file. e_pt5_eta60 test.009994.evgen.e_pt5_eta60._0001.pool.root error no tests beginOfRun , FATAL 2007-May-13 16:37:00 [static void ers::ErrorHandler::SignalHandler::action(int, siginfo_t*, void*) at ers/src/ErrorHandler.cxx:88] Got signal 11 Segmentation fault (invalid memory reference) #0 ers::LocalContext::LocalContext(char const*, char const*, int, char const*) from /afs/cern.ch/atlas/project/tdaq/cmt/tdaq-common/tdaq-common-01-06-01/installed/i686-slc4-gcc34-dbg/lib/libers.so /afs/cern.ch/atlas/project/RTT/Work/rel_0/val/build/i686-slc4-gcc34-dbg/GeneratorsRTT/AthenaQuickGenCheck/J1_pythia_jetjet.rtt/352/LSFJOB_1160063/STDERR
test_ATLAS_Template460 Read from file. e_pt50_eta25 test.009998.evgen.e_pt50_eta25._0001.pool.root success no tests
test_ATLAS_Template470 Read from file. pi_pt5_eta60 test.009992.evgen.pi_pt5_eta60._0001.pool.root error no tests beginOfRun , FATAL 2007-May-13 16:38:09 [static void ers::ErrorHandler::SignalHandler::action(int, siginfo_t*, void*) at ers/src/ErrorHandler.cxx:88] Got signal 11 Segmentation fault (invalid memory reference) #0 ers::LocalContext::LocalContext(char const*, char const*, int, char const*) from /afs/cern.ch/atlas/project/tdaq/cmt/tdaq-common/tdaq-common-01-06-01/installed/i686-slc4-gcc34-dbg/lib/libers.so /afs/cern.ch/atlas/project/RTT/Work/rel_0/val/build/i686-slc4-gcc34-dbg/PyJobTransformsRTT/JobTransform/FullChain.7218.singlepart_mu20/306/LSFJOB_1160075/STDERR
test_ATLAS_Template472 Read from file. pi_pt50_eta32 test.009997.evgen.pi_pt50_eta32._0001.pool.root error no tests beginOfRun , FATAL 2007-May-13 17:06:07 [static void ers::ErrorHandler::SignalHandler::action(int, siginfo_t*, void*) at ers/src/ErrorHandler.cxx:88] Got signal 11 Segmentation fault (invalid memory reference) #0 ers::LocalContext::LocalContext(char const*, char const*, int, char const*) from /afs/cern.ch/atlas/project/tdaq/cmt/tdaq-common/tdaq-common-01-06-01/installed/i686-slc4-gcc34-dbg/lib/libers.so /afs/cern.ch/atlas/project/RTT/Work/rel_0/val/build/i686-slc4-gcc34-dbg/PyJobTransformsRTT/JobTransform/FullChain.5224.AlpgenJimmyWenuNp3/307/LSFJOB_1160085/STDERR
test_G4AtlasTests434 Tests detector functionality using G4AtlasTests n/a success no tests
rel_5/val/build run --- i686-slc4-gcc34-dbg --- G4AtlasApps
test_ATLAS_GeoTest434   n/a success no tests
test_ATLAS_Template436   n/a success no tests
test_ATLAS_Template438   n/a success no tests
test_ATLAS_Template440   n/a success no tests
test_ATLAS_Template442   csc11.005200.T1_McAtNlo_Jimmy.evgen.EVNT.v11000401._00001.pool.root success no tests
test_ATLAS_Template444   n/a success no tests
test_ATLAS_Template446   n/a success no tests
test_ATLAS_Template448   n/a error no tests GenEvent: #215, /afs/cern.ch/atlas/project/RTT/Work/rel_5/val/build/i686-slc4-gcc34-dbg/G4AtlasApps/AthenaG4AtlasApps/test_ATLAS_Template/448/runScript.sh: line 29: 32618 Killed athena.py -c 'RTTRunNumber=200301' -bs G4AtlasApps/test_ATLAS_Template.py 0>&- /afs/cern.ch/atlas/project/RTT/Work/rel_5/val/build/i686-slc4-gcc34-dbg/PyJobTransformsRTT/JobTransform/FullChain.5224.AlpgenJimmyWenuNp3/305/LSFJOB_1056682/STDERR 12866 s 34555 s 14490 s 567MB 904MB atlasrttmedium
test_ATLAS_Template450   test.009996.evgen.mu_pt5_eta60._0001.pool.root error no tests
test_ATLAS_Template452   test.009999.evgen.mu_pt50_eta30._0001.pool.root error no tests
test_ATLAS_Template456   test.009994.evgen.e_pt5_eta60._0001.pool.root error no tests
test_ATLAS_Template458   test.009998.evgen.e_pt50_eta25._0001.pool.root error no tests
test_ATLAS_Template468   test.009992.evgen.pi_pt5_eta60._0001.pool.root error no tests
test_ATLAS_Template470   test.009997.evgen.pi_pt50_eta32._0001.pool.root error no tests
test_G4AtlasTests432   n/a success no tests

rel_4 07/05/10@17:30 07/05/11@06:19 83 G4AtlasApps-00-02-02 15/15 10/15 0/10
Name Description Datasets Job Combined Checks
test_ATLAS_GeoTest434 Recursive geometry test. Done only on G4 and geomodel envelopes success no tests

Release Started Completed
rel_4 07/05/10@17:30 07/05/11@06:19

test_ATLAS_Template436 n/a

Release Started Completed Job Combined Checks
rel_4 07/05/10@17:30 07/05/11@06:19 success no tests

test_ATLAS_Template438 n/a

Release Started Completed Job Combined Checks diagnosis
rel_4 07/05/10@17:30 07/05/11@06:19 batchError unavailable No files available

test_ATLAS_Template440 n/a

Release Started Completed Job Combined Checks
rel_4 07/05/10@17:30 07/05/11@06:19 success no tests

test_ATLAS_Template442 csc11.005200.T1_McAtNlo_Jimmy.evgen.EVNT.v11000401._00001.pool.root

Release Started Completed Job Combined Checks
rel_4 07/05/10@17:30 07/05/11@06:19 success no tests

test_ATLAS_Template444 n/a

Release Started Completed Job Combined Checks
rel_4 07/05/10@17:30 07/05/11@06:19 success no tests

test_ATLAS_Template446 n/a

Release Started Completed Job Combined Checks
rel_4 07/05/10@17:30 07/05/11@06:19 success no tests

test_ATLAS_Template448 n/a

Release Started Completed Job Combined Checks diagnosis
rel_4 07/05/10@17:30 07/05/11@06:19 error no tests Event: #210,/afs/cern.ch/atlas/project/RTT/Work/rel_4/val/build/i686-slc4-gcc34-dbg/G4AtlasApps/AthenaG4AtlasApps/test_ATLAS_Template/448/runScript.sh: line 29: 12474 Killed athena.py -c 'RTTRunNumber=200301' -bs G4AtlasApps/test_ATLAS_Template.py 0>&- /afs/cern.ch/atlas/project/RTT/Work/rel_4/val/build/i686-slc4-gcc34-dbg/MuonDigiExample/AthenaMuonDigiExample/CSCDigitValidationOptions_RTT/282/LSFJOB_1041972/STDERR 12873 s 34574 s 17637 s 1MB 105MB atlasrttmedium

test_ATLAS_Template450 test.009996.evgen.mu_pt5_eta60._0001.pool.root

Release Started Completed Job Combined Checks diagnosis
rel_4 07/05/10@17:30 07/05/11@06:19 error no tests beginOfRun

test_ATLAS_Template452 test.009999.evgen.mu_pt50_eta30._0001.pool.root

Release Started Completed Job Combined Checks diagnosis
rel_4 07/05/10@17:30 07/05/11@06:19 error no tests beginOfRun

test_ATLAS_Template456 test.009994.evgen.e_pt5_eta60._0001.pool.root

Release Started Completed Job Combined Checks
rel_4 07/05/10@17:30 07/05/11@06:19 success no tests

test_ATLAS_Template458 test.009998.evgen.e_pt50_eta25._0001.pool.root

Release Started Completed Job Combined Checks
rel_4 07/05/10@17:30 07/05/11@06:19 success no tests

test_ATLAS_Template468 test.009992.evgen.pi_pt5_eta60._0001.pool.root

Release Started Completed Job Combined Checks
rel_4 07/05/10@17:30 07/05/11@06:19 success no tests

test_ATLAS_Template470 test.009997.evgen.pi_pt50_eta32._0001.pool.root

Release Started Completed Job Combined Checks diagnosis
rel_4 07/05/10@17:30 07/05/11@06:19 error no tests beginOfRun

test_G4AtlasTests432 n/a

Release Started Completed Job Combined Checks
rel_4 07/05/10@17:30 07/05/11@06:19 success no tests

val/build/i686-slc4-gcc34-dbg:

test_ATLAS_Template430

rel_6 07/04/21@12:00 n/a job finished during GenEvent: #221

test_ATLAS_Template432:

rel_6 07/04/21@12:00 n/a job finished after beginOfRun phase
...

bugfix i686-slc3-gcc323-opt

Release Started Completed Total jobs OK G4 jobs Done jobs Jobs completing OK Jobs with all post-run tests OK
--- --- --- --- --- --- ---
rel_0 07/05/13@18:01 07/05/14@07:36 91
rel_6 07/05/12@17:25 07/05/13@10:14 63
rel_5 07/05/11@14:30 07/05/12@08:35 76
rel_4 07/05/10@21:04 07/05/11@06:17 58
rel_3 07/05/09@15:31 07/05/10@07:29 57
--- --- --- --- --- --- ---
rel_4 07/05/10@21:04 07/05/11@06:17   15 15 1 n/a

Release Started Completed Name Job Combined Checks Ref. Release
rel_4 07/05/10@21:04 07/05/11@06:17 test_ATLAS_GeoTest434 success no tests
rel_4 07/05/10@21:04 07/05/11@06:17 all test_ATLAS_Template436-470 error no tests Sensitive Detector entry TRTSensitiveDetectornotfound!
rel_4 07/05/10@21:04 07/05/11@06:17 test_G4AtlasTests432 error no tests Sensitive Detector entry TRTSensitiveDetectornotfound!

bugfix --- i686-slc4-gcc34-opt --- G4AtlasApps
Release Started Completed Total jobs G4 jobs Done jobs Jobs completing OK Jobs with all post-run tests OK
rel_1 07/05/14@08:10 n/a 89
rel_0 07/05/13@10:45 07/05/14@07:42 93 15 15 8 n/a
rel_6 07/05/12@11:30 07/05/13@10:25 70
rel_5 07/05/11@09:30 07/05/12@08:44 85
rel_4 07/05/10@16:00 07/05/11@06:24 93 15 15 8 n/a
rel_3 07/05/09@09:10 07/05/10@07:44 84
rel_2 07/05/08@10:40 07/05/08@21:05 57

Release Started Completed Name Dataset Job Combined Checks
rel_0 07/05/13@10:45 07/05/14@07:42
test_ATLAS_GeoTest434 Recursive geometry test. Done only on G4 and geomodel envelopes success no tests
test_ATLAS_Template436 Gen on the fly. single-e-pt50-eta2.5 success no tests
test_ATLAS_Template438 Gen on the fly. single-mu-pt100-eta3.0 success no tests
test_ATLAS_Template440 Gen on the fly. single-pi-pt50-eta5.0 success no tests
test_ATLAS_Template442 Read from file. T1_McAtNlo_Jimmy success no tests
test_ATLAS_Template444 Gen on the fly. single e pt50GeV eta2.5 success no tests
test_ATLAS_Template446 Gen on the fly. single mu pt50GeV eta3.0 success no tests
test_ATLAS_Template448 Gen on the fly. single pi pt50GeV eta3.2 error no tests GenEvent: #282, /afs/cern.ch/user/r/rtt//LSFJOB_1156455/STDERR not accessible
test_ATLAS_Template450 Read from file. mu_pt5_eta60 error no tests beginOfRun , /afs/cern.ch/user/r/rtt/LSFJOB_1156461/STDERR not accessible
test_ATLAS_Template452 Read from file. mu_pt50_eta30 error no tests beginOfRun , /afs/cern.ch/user/r/rtt/LSFJOB_1156473/STDERR not accessible
test_ATLAS_Template456 Read from file. e_pt5_eta60 error no tests beginOfRun , /afs/cern.ch/user/r/rtt/LSFJOB_1156481/STDERR not accessible
test_ATLAS_Template458 Read from file. e_pt50_eta25 timedOut unavailable
test_ATLAS_Template468 Read from file. pi_pt5_eta60 error no tests beginOfRun , FATAL 2007-May-13 13:24:13 [static void ers::ErrorHandler::SignalHandler::action(int, siginfo_t*, void*) at ers/src/ErrorHandler.cxx:88] Got signal 11 Segmentation fault (invalid memory reference)
test_ATLAS_Template470 Read from file. pi_pt50_eta32 error no tests beginOfRun , FATAL 2007-May-13 13:13:16 [static void ers::ErrorHandler::SignalHandler::action(int, siginfo_t*, void*) at ers/src/ErrorHandler.cxx:88] Got signal 11 Segmentation fault (invalid memory reference)
test_G4AtlasTests432 Tests detector functionality using G4AtlasTests success no tests
rel_5    
    test_ATLAS_Template448 n/a error no tests GenEvent: #278
      test_ATLAS_Template450 009996.mu_pt5_eta60 error no tests no obvious clue in log and err
      test_ATLAS_Template452 009999.mu_pt50_eta30 error no tests beginOfRun, Segmentation fault (invalid memory reference)
    test_ATLAS_Template456 009994.e_pt5_eta60 error no tests beginOfRun, Segmentation fault (invalid memory reference)
    test_ATLAS_Template458 009998.e_pt50_eta25 error no tests beginOfRun, Segmentation fault (invalid memory reference)
    test_ATLAS_Template470 009997.pi_pt50_eta32 error no tests beginOfRun, Segmentation fault (invalid memory reference)
rel_4 07/05/10@16:00 07/05/11@06:24 test_ATLAS_GeoTest434 n/a error no tests before CORAL/Services/ConnectionService
rel_4 07/05/10@16:00 07/05/11@06:24 test_ATLAS_Template448 n/a error no tests GenEvent: #294
rel_4 07/05/10@16:00 07/05/11@06:24 test_ATLAS_Template450 009996.mu_pt5_eta60 error no tests beginOfRun
rel_4 07/05/10@16:00 07/05/11@06:24 test_ATLAS_Template452 009999.mu_pt50_eta30 error no tests beginOfRun
rel_4 07/05/10@16:00 07/05/11@06:24 test_ATLAS_Template456 009994.e_pt5_eta60 error no tests beginOfRun
rel_4 07/05/10@16:00 07/05/11@06:24 test_ATLAS_Template458 009998.e_pt50_eta25 error no tests beginOfRun
rel_4 07/05/10@16:00 07/05/11@06:24 test_ATLAS_Template470 009997.pi_pt50_eta32 error no tests beginOfRun

bugfix/build/i686-slc4-gcc34-opt:

test_ATLAS_Template430:

rel_6 07/04/21@04:00 n/a job finished during GenEvent: #278

test_ATLAS_Template432:

rel_6 07/04/21@04:00 n/a job finished after beginOfRun phase
...


% ssh lxplus bqueues -l atlasrttmedium

QUEUE: atlasrttmedium
  -- ATLAS RTT Medium Queue - CPU limit: (8 KSI2K hours).

 CPULIMIT                
 480.0 min of KSI2K

 RUNLIMIT                
 9600.0 min of KSI2K


% ssh lxplus bqueues -l atlasrttlong  

QUEUE: atlasrttlong
  -- ATLAS RTT Long Queue - CPU limit: (72 KSI2K hours).

 CPULIMIT                
 4320.0 min of KSI2K

 RUNLIMIT                
 86400.0 min of KSI2K

-- Main.iueda - 01 Jun 2007

-- Main.iueda - 07 Jun 2007

 
This site is powered by the TWiki collaboration platform Powered by PerlCopyright & 2008-2019 by the contributing authors. All material on this collaboration platform is the property of the contributing authors.
Ideas, requests, problems regarding TWiki? Send feedback