Certification Report for caNl-c EMI2 RC4 (caNl-c 1.0, multiplatform)

Origins

Component emi.canl
Task https://savannah.cern.ch/task/?24865
Configuration emi-canl_R_1_0_3_1
Tag emi-canl_R_1_0_3_1
Release Matterhorn
Platform multiplatform
Author Zdeněk Šustr
Date 17 Apr 2012
Build Report
YUM repo file https://twiki.cern.ch/twiki/pub/EMI/EMI-2/emi-2-rc4-sl5.repo
https://twiki.cern.ch/twiki/pub/EMI/EMI-2/emi-2-rc4-sl6.repo
Patch
Status Finished
Duration
Previous report

Summary (EMI Test Report Structure)

  1. Deployment log:
    1. Clean InstallationPASS
    2. Upgrade InstallationPASS
  2. Static Code Analysis—N/A (The prevalent programming language is C)
  3. Unit Tests ExecutionNO
  4. System tests:
    1. Basic Functionality testsFAIL
    2. Regression testsN/A
    3. Performance/Scalability tests—N/A
    4. Standard Compliance/Conformance tests—N/A

Remarks: Failures in tests have been attributed partly to a bug in the test suite, and partly to actual bugs in code. Will be fixed in the final release. Unit tests will be used for final release.

Clean installation, Scientific 5 (i386)

Environment

Clean installation according to EMI guidelines (CA certificates, proxy certificate...).

OS Issue Scientific Linux SL release 5.7 (Boron)
Platform i386
Host skirit79-2.ics.muni.cz
Duration 0 min
Testbed uptime 17:42:53 up 8 min,  0 users,  load average: 2.81, 3.56, 1.73

Process

wget -q --no-check-certificate -O /etc/yum.repos.d/emi-2-rc4-sl5.repo https://twiki.cern.ch/twiki/pub/EMI/EMI-2/emi-2-rc4-sl5.repo
yum install -y yum-priorities yum-protectbase

yum install -y --nogpgcheck canl-c canl-c-examples

Full Output of the Installation

Loaded plugins: downloadonly, kernel-module
Setting up Install Process
Resolving Dependencies
--> Running transaction check
---> Package yum-priorities.noarch 0:1.1.16-16.el5 set to be updated
---> Package yum-protectbase.noarch 0:1.1.16-16.el5 set to be updated
--> Finished Dependency Resolution
Beginning Kernel Module Plugin
Finished Kernel Module Plugin

Dependencies Resolved

================================================================================
 Package                Arch          Version                 Repository   Size
================================================================================
Installing:
 yum-priorities         noarch        1.1.16-16.el5           core         14 k
 yum-protectbase        noarch        1.1.16-16.el5           core         13 k

Transaction Summary
================================================================================
Install       2 Package(s)
Upgrade       0 Package(s)

Total download size: 27 k
Downloading Packages:
--------------------------------------------------------------------------------
Total                                           246 kB/s |  27 kB     00:00     
Running rpm_check_debug
Running Transaction Test
Finished Transaction Test
Transaction Test Succeeded
Running Transaction

  Installing     : yum-priorities                                           1/2 

  Installing     : yum-protectbase                                          2/2 

Installed:
  yum-priorities.noarch 0:1.1.16-16.el5  yum-protectbase.noarch 0:1.1.16-16.el5 

Complete!
Loaded plugins: downloadonly, kernel-module, priorities, protectbase
2988 packages excluded due to repository priority protections
0 packages excluded due to repository protections
Setting up Install Process
No package canl-c available.
No package canl-c-examples available.
Nothing to do

Tests

TestPlan N/A
Tests http://jra1mw.cvs.cern.ch/cgi-bin/jra1mw.cgi/org.glite.testsuites.ctb/CANL-C/tests/

Certificate file: none 
gLite user:       glite 
Terminal width:   80 
Output format:    -x 
Package wget-1.11.4-2.el5_4.1.i386 already installed and latest version
Package lsof-4.78-3.i386 already installed and latest version
Package cvs-1.11.22-11.el5_8.1.i386 already installed and latest version
`/tmp/test-certs.root/grid-security/certificates/5a762d74.0' -> `/etc/grid-security/certificates/5a762d74.0'
`/tmp/test-certs.root/grid-security/certificates/5a762d74.namespaces' -> `/etc/grid-security/certificates/5a762d74.namespaces'
`/tmp/test-certs.root/grid-security/certificates/5a762d74.r0' -> `/etc/grid-security/certificates/5a762d74.r0'
`/tmp/test-certs.root/grid-security/certificates/5a762d74.signing_policy' -> `/etc/grid-security/certificates/5a762d74.signing_policy'
U org.glite.testsuites.ctb/CANL-C/tests/Makefile
U org.glite.testsuites.ctb/CANL-C/tests/canl-autonomous-test.sh
U org.glite.testsuites.ctb/CANL-C/tests/canl-common-testbeds.sh
U org.glite.testsuites.ctb/CANL-C/tests/canl-common.sh
U org.glite.testsuites.ctb/CANL-C/tests/canl-generate-fake-proxy.sh
U org.glite.testsuites.ctb/CANL-C/tests/canl-test-cert-handle.sh
U org.glite.testsuites.ctb/CANL-C/tests/canl-test-cs-openssl.sh
U org.glite.testsuites.ctb/CANL-C/tests/canl-test-sec-connection.sh
U org.glite.testsuites.ctb/CANL-C/tests/test-common.sh
========================
  REAL TESTS START HERE
========================
Apr 04 17:42:45 skirit79-2.ics.muni.cz canl-test-cert-handle.sh:    start
Testing if binary of canl_proxy_init is available Error: emi-canl-proxy-init not found
   -TEST FAILED-
Downloading canl source files and building examples   -TEST FAILED-
   -TEST FAILED-
Apr 04 17:42:45 skirit79-2.ics.muni.cz canl-test-cert-handle.sh:    end
Apr 04 17:42:45 skirit79-2.ics.muni.cz canl-test-cs-openssl.sh:    start
Testing if binaries of canl examples are available Error: emi-canl-server not found
Error: emi-canl-client not found
   -TEST FAILED-
Downloading canl source files and building examples   -TEST FAILED-
   -TEST FAILED-
Apr 04 17:42:45 skirit79-2.ics.muni.cz canl-test-cs-openssl.sh:    end
Apr 04 17:42:45 skirit79-2.ics.muni.cz canl-test-sec-connection.sh:    start
Testing if binaries of canl examples are available Error: emi-canl-server not found
Error: emi-canl-client not found
   -TEST FAILED-
Downloading canl source files and building examples   -TEST FAILED-
   -TEST FAILED-
Apr 04 17:42:46 skirit79-2.ics.muni.cz canl-test-sec-connection.sh:    end
==================
  TESTS END HERE
==================

Clean installation, Scientific 5 (x86_64)

Environment

Clean installation according to EMI guidelines (CA certificates, proxy certificate...).

OS Issue Scientific Linux SL release 5.7 (Boron)
Platform x86_64
Host skirit75-2.ics.muni.cz
Duration 0 min
Testbed uptime 17:40:04 up 14 min,  0 users,  load average: 3.22, 4.62, 2.30

Process

wget -q --no-check-certificate -O /etc/yum.repos.d/emi-2-rc4-sl5.repo https://twiki.cern.ch/twiki/pub/EMI/EMI-2/emi-2-rc4-sl5.repo
yum install -y yum-priorities yum-protectbase

yum install -y --nogpgcheck canl-c canl-c-examples

Full Output of the Installation

Loaded plugins: downloadonly, kernel-module
Setting up Install Process
Resolving Dependencies
--> Running transaction check
---> Package yum-priorities.noarch 0:1.1.16-16.el5 set to be updated
---> Package yum-protectbase.noarch 0:1.1.16-16.el5 set to be updated
--> Finished Dependency Resolution
Beginning Kernel Module Plugin
Finished Kernel Module Plugin

Dependencies Resolved

================================================================================
 Package                Arch          Version                 Repository   Size
================================================================================
Installing:
 yum-priorities         noarch        1.1.16-16.el5           core         14 k
 yum-protectbase        noarch        1.1.16-16.el5           core         13 k

Transaction Summary
================================================================================
Install       2 Package(s)
Upgrade       0 Package(s)

Total download size: 27 k
Downloading Packages:
--------------------------------------------------------------------------------
Total                                           252 kB/s |  27 kB     00:00     
Running rpm_check_debug
Running Transaction Test
Finished Transaction Test
Transaction Test Succeeded
Running Transaction

  Installing     : yum-priorities                                           1/2 

  Installing     : yum-protectbase                                          2/2 

Installed:
  yum-priorities.noarch 0:1.1.16-16.el5  yum-protectbase.noarch 0:1.1.16-16.el5 

Complete!
Loaded plugins: downloadonly, kernel-module, priorities, protectbase
3906 packages excluded due to repository priority protections
0 packages excluded due to repository protections
Setting up Install Process
Resolving Dependencies
--> Running transaction check
---> Package canl-c.x86_64 0:1.0.3-1.el5 set to be updated
--> Processing Dependency: libcares.so.2()(64bit) for package: canl-c
---> Package canl-c-examples.x86_64 0:1.0.3-1.el5 set to be updated
--> Running transaction check
---> Package c-ares.x86_64 0:1.6.0-5.el5 set to be updated
--> Finished Dependency Resolution
Beginning Kernel Module Plugin
Finished Kernel Module Plugin

Dependencies Resolved

================================================================================
 Package              Arch        Version             Repository           Size
================================================================================
Installing:
 canl-c               x86_64      1.0.3-1.el5         EMI-2-RC4-base       53 k
 canl-c-examples      x86_64      1.0.3-1.el5         EMI-2-RC4-base       12 k
Installing for dependencies:
 c-ares               x86_64      1.6.0-5.el5         sl-base              49 k

Transaction Summary
================================================================================
Install       3 Package(s)
Upgrade       0 Package(s)

Total download size: 114 k
Downloading Packages:
--------------------------------------------------------------------------------
Total                                           290 kB/s | 114 kB     00:00     
Running rpm_check_debug
Running Transaction Test
Finished Transaction Test
Transaction Test Succeeded
Running Transaction

  Installing     : c-ares                                                   1/3 

  Installing     : canl-c                                                   2/3 

  Installing     : canl-c-examples                                          3/3 

Installed:
  canl-c.x86_64 0:1.0.3-1.el5        canl-c-examples.x86_64 0:1.0.3-1.el5       

Dependency Installed:
  c-ares.x86_64 0:1.6.0-5.el5                                                   

Complete!

Tests

TestPlan N/A
Tests http://jra1mw.cvs.cern.ch/cgi-bin/jra1mw.cgi/org.glite.testsuites.ctb/CANL-C/tests/

Certificate file: none 
gLite user:       glite 
Terminal width:   80 
Output format:    -x 
Package wget-1.11.4-2.el5_4.1.x86_64 already installed and latest version
Package lsof-4.78-3.x86_64 already installed and latest version
Package canl-c-examples-1.0.3-1.el5.x86_64 already installed and latest version
Package cvs-1.11.22-11.el5_8.1.x86_64 already installed and latest version
`/tmp/test-certs.root/grid-security/certificates/5a762d74.0' -> `/etc/grid-security/certificates/5a762d74.0'
`/tmp/test-certs.root/grid-security/certificates/5a762d74.namespaces' -> `/etc/grid-security/certificates/5a762d74.namespaces'
`/tmp/test-certs.root/grid-security/certificates/5a762d74.r0' -> `/etc/grid-security/certificates/5a762d74.r0'
`/tmp/test-certs.root/grid-security/certificates/5a762d74.signing_policy' -> `/etc/grid-security/certificates/5a762d74.signing_policy'
U org.glite.testsuites.ctb/CANL-C/tests/Makefile
U org.glite.testsuites.ctb/CANL-C/tests/canl-autonomous-test.sh
U org.glite.testsuites.ctb/CANL-C/tests/canl-common-testbeds.sh
U org.glite.testsuites.ctb/CANL-C/tests/canl-common.sh
U org.glite.testsuites.ctb/CANL-C/tests/canl-generate-fake-proxy.sh
U org.glite.testsuites.ctb/CANL-C/tests/canl-test-cert-handle.sh
U org.glite.testsuites.ctb/CANL-C/tests/canl-test-cs-openssl.sh
U org.glite.testsuites.ctb/CANL-C/tests/canl-test-sec-connection.sh
U org.glite.testsuites.ctb/CANL-C/tests/test-common.sh
========================
  REAL TESTS START HERE
========================
Apr 04 17:39:47 skirit75-2.ics.muni.cz canl-test-cert-handle.sh:    start
Testing if binary of canl_proxy_init is available   done
Testing if all binaries are available   done
Generating new proxy certificate    done
Simulating cert. delegation    -TEST FAILED-
Apr 04 17:39:47 skirit75-2.ics.muni.cz canl-test-cert-handle.sh:    end
Apr 04 17:39:47 skirit75-2.ics.muni.cz canl-test-cs-openssl.sh:    start
Testing if binaries of canl examples are available   done
Testing if all binaries are available   done
Testing credentials   done
Starting openssl server    done
CANL client: connecting to openssl server This is the testing message to send   done
Starting canl sample server    done
Openssl client: connect to CANL sample server This is a testing message to send   done
Apr 04 17:39:57 skirit75-2.ics.muni.cz canl-test-cs-openssl.sh:    end
Apr 04 17:39:57 skirit75-2.ics.muni.cz canl-test-sec-connection.sh:    start
Testing if binaries of canl examples are available   done
Testing if all binaries are available   done
Testing credentials   done
Testing server with nonexisting host certificates   done
Testing server with nonexisting host key   done
Testing server with nonexisting host cert and key   done
Testing client: connect to server not running   done
Testing client: use nonexisting proxy certificate   done
Starting canl sample server    done
CANL client: connect to CANL sample server [CLIENT] connection established [CLIENT] Trying to send sth to the server [CLIENT] message "This is the testing message to send" sent successfully [CLIENT] received: This is a testing message to send server: waiting for connections... [SERVER] connection established with (null) [SERVER] Trying to send sth to the client [SERVER] message "This is a testing message to send" sent successfully [SERVER] received: This is the testing message to se    done
Apr 04 17:39:57 skirit75-2.ics.muni.cz canl-test-sec-connection.sh:    end
==================
  TESTS END HERE
==================

Clean installation, Scientific 6 (x86_64)

Environment

Clean installation according to EMI guidelines (CA certificates, proxy certificate...).

OS Issue Scientific Linux release 6.2 (Carbon)
Platform x86_64
Host myriad14.zcu.cz
Duration 4 min
Testbed uptime 18:15:24 up 6 min,  1 user,  load average: 0.48, 0.53, 0.28

Process

wget -q --no-check-certificate -O /etc/yum.repos.d/emi-2-rc4-sl6.repo https://twiki.cern.ch/twiki/pub/EMI/EMI-2/emi-2-rc4-sl6.repo
yum install -y yum-priorities yum-protectbase

yum install -y --nogpgcheck canl-c canl-c-examples

Full Output of the Installation

Loaded plugins: security
Setting up Install Process
Resolving Dependencies
--> Running transaction check
---> Package yum-plugin-priorities.noarch 0:1.1.30-10.el6 will be installed
---> Package yum-plugin-protectbase.noarch 0:1.1.30-10.el6 will be installed
--> Finished Dependency Resolution

Dependencies Resolved

================================================================================
 Package                      Arch         Version             Repository  Size
================================================================================
Installing:
 yum-plugin-priorities        noarch       1.1.30-10.el6       core        21 k
 yum-plugin-protectbase       noarch       1.1.30-10.el6       core        19 k

Transaction Summary
================================================================================
Install       2 Package(s)

Total download size: 39 k
Installed size: 50 k
Downloading Packages:
--------------------------------------------------------------------------------
Total                                           331 kB/s |  39 kB     00:00     
Running rpm_check_debug
Running Transaction Test
Transaction Test Succeeded
Running Transaction

  Installing : yum-plugin-priorities-1.1.30-10.el6.noarch                   1/2 

  Installing : yum-plugin-protectbase-1.1.30-10.el6.noarch                  2/2 

Installed:
  yum-plugin-priorities.noarch 0:1.1.30-10.el6                                  
  yum-plugin-protectbase.noarch 0:1.1.30-10.el6                                 

Complete!
Loaded plugins: priorities, protectbase, security
113 packages excluded due to repository priority protections
0 packages excluded due to repository protections
Setting up Install Process
Resolving Dependencies
--> Running transaction check
---> Package canl-c.x86_64 0:1.0.3-1.el6 will be installed
--> Processing Dependency: libcares.so.2()(64bit) for package: canl-c-1.0.3-1.el6.x86_64
---> Package canl-c-examples.x86_64 0:1.0.3-1.el6 will be installed
--> Running transaction check
---> Package c-ares.x86_64 0:1.7.0-5.el6 will be installed
--> Finished Dependency Resolution

Dependencies Resolved

================================================================================
 Package              Arch        Version             Repository           Size
================================================================================
Installing:
 canl-c               x86_64      1.0.3-1.el6         EMI-2-RC4-base       45 k
 canl-c-examples      x86_64      1.0.3-1.el6         EMI-2-RC4-base       10 k
Installing for dependencies:
 c-ares               x86_64      1.7.0-5.el6         core                 52 k

Transaction Summary
================================================================================
Install       3 Package(s)

Total download size: 107 k
Installed size: 296 k
Downloading Packages:
--------------------------------------------------------------------------------
Total                                           337 kB/s | 107 kB     00:00     
Running rpm_check_debug
Running Transaction Test
Transaction Test Succeeded
Running Transaction

  Installing : c-ares-1.7.0-5.el6.x86_64                                    1/3 

  Installing : canl-c-1.0.3-1.el6.x86_64                                    2/3 

  Installing : canl-c-examples-1.0.3-1.el6.x86_64                           3/3 

Installed:
  canl-c.x86_64 0:1.0.3-1.el6        canl-c-examples.x86_64 0:1.0.3-1.el6       

Dependency Installed:
  c-ares.x86_64 0:1.7.0-5.el6                                                   

Complete!

Tests

TestPlan N/A
Tests http://jra1mw.cvs.cern.ch/cgi-bin/jra1mw.cgi/org.glite.testsuites.ctb/CANL-C/tests/

Certificate file: none 
gLite user:       glite 
Terminal width:   80 
Output format:    -x 
Package wget-1.12-1.4.el6.x86_64 already installed and latest version
Package canl-c-examples-1.0.3-1.el6.x86_64 already installed and latest version
Package cvs-1.11.23-11.el6_2.1.x86_64 already installed and latest version
`/tmp/test-certs.root/grid-security/certificates/0e2ca11d.0' -> `/etc/grid-security/certificates/0e2ca11d.0'
`/tmp/test-certs.root/grid-security/certificates/0e2ca11d.namespaces' -> `/etc/grid-security/certificates/0e2ca11d.namespaces'
`/tmp/test-certs.root/grid-security/certificates/0e2ca11d.r0' -> `/etc/grid-security/certificates/0e2ca11d.r0'
`/tmp/test-certs.root/grid-security/certificates/0e2ca11d.signing_policy' -> `/etc/grid-security/certificates/0e2ca11d.signing_policy'
`/tmp/test-certs.root/grid-security/certificates/0fbe317b.0' -> `/etc/grid-security/certificates/0fbe317b.0'
`/tmp/test-certs.root/grid-security/certificates/0fbe317b.namespaces' -> `/etc/grid-security/certificates/0fbe317b.namespaces'
`/tmp/test-certs.root/grid-security/certificates/0fbe317b.r0' -> `/etc/grid-security/certificates/0fbe317b.r0'
`/tmp/test-certs.root/grid-security/certificates/0fbe317b.signing_policy' -> `/etc/grid-security/certificates/0fbe317b.signing_policy'
`/tmp/test-certs.root/grid-security/certificates/36395d3c.0' -> `/etc/grid-security/certificates/36395d3c.0'
`/tmp/test-certs.root/grid-security/certificates/36395d3c.namespaces' -> `/etc/grid-security/certificates/36395d3c.namespaces'
`/tmp/test-certs.root/grid-security/certificates/36395d3c.r0' -> `/etc/grid-security/certificates/36395d3c.r0'
`/tmp/test-certs.root/grid-security/certificates/36395d3c.signing_policy' -> `/etc/grid-security/certificates/36395d3c.signing_policy'
`/tmp/test-certs.root/grid-security/certificates/41a90451.0' -> `/etc/grid-security/certificates/41a90451.0'
`/tmp/test-certs.root/grid-security/certificates/41a90451.namespaces' -> `/etc/grid-security/certificates/41a90451.namespaces'
`/tmp/test-certs.root/grid-security/certificates/41a90451.r0' -> `/etc/grid-security/certificates/41a90451.r0'
`/tmp/test-certs.root/grid-security/certificates/41a90451.signing_policy' -> `/etc/grid-security/certificates/41a90451.signing_policy'
`/tmp/test-certs.root/grid-security/certificates/7362bbd6.0' -> `/etc/grid-security/certificates/7362bbd6.0'
`/tmp/test-certs.root/grid-security/certificates/7362bbd6.namespaces' -> `/etc/grid-security/certificates/7362bbd6.namespaces'
`/tmp/test-certs.root/grid-security/certificates/7362bbd6.r0' -> `/etc/grid-security/certificates/7362bbd6.r0'
`/tmp/test-certs.root/grid-security/certificates/7362bbd6.signing_policy' -> `/etc/grid-security/certificates/7362bbd6.signing_policy'
`/tmp/test-certs.root/grid-security/certificates/79356fdd.0' -> `/etc/grid-security/certificates/79356fdd.0'
`/tmp/test-certs.root/grid-security/certificates/79356fdd.namespaces' -> `/etc/grid-security/certificates/79356fdd.namespaces'
`/tmp/test-certs.root/grid-security/certificates/79356fdd.r0' -> `/etc/grid-security/certificates/79356fdd.r0'
`/tmp/test-certs.root/grid-security/certificates/79356fdd.signing_policy' -> `/etc/grid-security/certificates/79356fdd.signing_policy'
`/tmp/test-certs.root/grid-security/certificates/9a529ab0.0' -> `/etc/grid-security/certificates/9a529ab0.0'
`/tmp/test-certs.root/grid-security/certificates/9a529ab0.namespaces' -> `/etc/grid-security/certificates/9a529ab0.namespaces'
`/tmp/test-certs.root/grid-security/certificates/9a529ab0.r0' -> `/etc/grid-security/certificates/9a529ab0.r0'
`/tmp/test-certs.root/grid-security/certificates/9a529ab0.signing_policy' -> `/etc/grid-security/certificates/9a529ab0.signing_policy'
`/tmp/test-certs.root/grid-security/certificates/c1d9b6d3.0' -> `/etc/grid-security/certificates/c1d9b6d3.0'
`/tmp/test-certs.root/grid-security/certificates/c1d9b6d3.namespaces' -> `/etc/grid-security/certificates/c1d9b6d3.namespaces'
`/tmp/test-certs.root/grid-security/certificates/c1d9b6d3.r0' -> `/etc/grid-security/certificates/c1d9b6d3.r0'
`/tmp/test-certs.root/grid-security/certificates/c1d9b6d3.signing_policy' -> `/etc/grid-security/certificates/c1d9b6d3.signing_policy'
`/tmp/test-certs.root/grid-security/certificates/ffb9710f.0' -> `/etc/grid-security/certificates/ffb9710f.0'
`/tmp/test-certs.root/grid-security/certificates/ffb9710f.namespaces' -> `/etc/grid-security/certificates/ffb9710f.namespaces'
`/tmp/test-certs.root/grid-security/certificates/ffb9710f.r0' -> `/etc/grid-security/certificates/ffb9710f.r0'
`/tmp/test-certs.root/grid-security/certificates/ffb9710f.signing_policy' -> `/etc/grid-security/certificates/ffb9710f.signing_policy'
U org.glite.testsuites.ctb/CANL-C/tests/Makefile
U org.glite.testsuites.ctb/CANL-C/tests/canl-autonomous-test.sh
U org.glite.testsuites.ctb/CANL-C/tests/canl-common-testbeds.sh
U org.glite.testsuites.ctb/CANL-C/tests/canl-common.sh
U org.glite.testsuites.ctb/CANL-C/tests/canl-generate-fake-proxy.sh
U org.glite.testsuites.ctb/CANL-C/tests/canl-test-cert-handle.sh
U org.glite.testsuites.ctb/CANL-C/tests/canl-test-cs-openssl.sh
U org.glite.testsuites.ctb/CANL-C/tests/canl-test-sec-connection.sh
U org.glite.testsuites.ctb/CANL-C/tests/canl-test-sha2.sh
U org.glite.testsuites.ctb/CANL-C/tests/test-common.sh
========================
  REAL TESTS START HERE
========================
Apr 16 18:14:56 myriad14.zcu.cz canl-test-cert-handle.sh:    start
Testing if binary of canl_proxy_init is available   done
Testing if all binaries are available   done
Generating new proxy certificate    done
Simulating cert. delegation    -TEST FAILED-
Apr 16 18:14:56 myriad14.zcu.cz canl-test-cert-handle.sh:    end
Apr 16 18:14:56 myriad14.zcu.cz canl-test-cs-openssl.sh:    start
Testing if binaries of canl examples are available   done
Testing if all binaries are available   done
Testing credentials   done
Starting openssl server    done
CANL client: connecting to openssl server    -TEST FAILED-
Starting canl sample server    done
Openssl client: connect to CANL sample server    -TEST FAILED-
Apr 16 18:15:16 myriad14.zcu.cz canl-test-cs-openssl.sh:    end
Apr 16 18:15:16 myriad14.zcu.cz canl-test-sec-connection.sh:    start
Testing if binaries of canl examples are available   done
Testing if all binaries are available   done
Testing credentials   done
Testing server with nonexisting host certificates   done
Testing server with nonexisting host key   done
Testing server with nonexisting host cert and key   done
Testing client: connect to server not running   done
Testing client: use nonexisting proxy certificate   done
Starting canl sample server    done
CANL client: connect to CANL sample server [CLIENT] connection to myriad14.zcu.cz myriad14.zcu.cz cannot be established: Failed to make network connection to server myriad14.zcu.cz myriad14.zcu.cz : Connection refused: Cannot resolve the server hostname (myriad14.zcu.cz myriad14.zcu.cz ): Unknown resolver error: Cannot resolve the server hostname (myriad14.zcu.cz myriad14.zcu.cz ): Unknown resolver error:    -TEST FAILED-
Apr 16 18:15:16 myriad14.zcu.cz canl-test-sec-connection.sh:    end
==================
  TESTS END HERE
==================

-- ZdenekSustr - 17-Apr-2012

Edit | Attach | Watch | Print version | History: r1 | Backlinks | Raw View | WYSIWYG | More topic actions
Topic revision: r1 - 2012-04-17 - ZdenekSustr
 
    • Cern Search Icon Cern Search
    • TWiki Search Icon TWiki Search
    • Google Search Icon Google Search

    EMI All webs login

This site is powered by the TWiki collaboration platform Powered by PerlCopyright &© 2008-2020 by the contributing authors. All material on this collaboration platform is the property of the contributing authors.
Ideas, requests, problems regarding TWiki? Send feedback