Certification Report for caNl EMI3 RC1 (caNl 2.0.1, multiplatform)

Origins

Component emi.canl
Task https://savannah.cern.ch/task/?34037
Configuration emi-canl_R_2_0_1_1
Tag emi-canl_R_2_0_1_1 (C part), tags/canl-1.1.0 (Java part)
Release Matterhorn
Platform SL5 SL6 Deb6
Author Zdeněk Šustr
Date 2020-08-09
Build Report
YUM repo file
APT repo file
Patch
Status Finished
Duration
Previous report https://twiki.cern.ch/twiki/bin/view/EMI/CaNlC-partEMI2FinalRC

Summary (EMI Test Report Structure)

  1. Deployment log:
    1. Clean InstallationPASS
    2. Upgrade InstallationPASS
  2. Static Code Analysis—N/A (The prevalent programming language is C)
  3. Unit Tests ExecutionYES
  4. System tests:
    1. Basic Functionality testsPASS
    2. Regression testsN/A
    3. Performance/Scalability tests—N/A
    4. Standard Compliance/Conformance tests—N/A

Remarks:

C Part

Clean installation, Debian 6 (unknown)

Environment

Clean installation according to EMI guidelines (CA certificates, proxy certificate...).

| OS Issue | Debian GNU/Linux 6.0 \l |

Platform unknown
Host skirit79-2.ics.muni.cz
Duration 1 min
Testbed uptime 01:01:18 up 9 min,  0 users,  load average: 0.31, 0.22, 0.11

wget --no-verbose -P /etc/apt/sources.list.d http://eticssoft.web.cern.ch/eticssoft/pbuilder/emi-3-rc-deb6.list apt-key adv --fetch-keys http://emisoft.web.cern.ch/emisoft/dist/EMI/3/RPM-GPG-KEY-emi aptitude update

aptitude install -y --allow-untrusted libcanl-c-examples

Full Output of the Installation

Executing: gpg --ignore-time-conflict --no-options --no-default-keyring --secret-keyring /etc/apt/secring.gpg --trustdb-name /etc/apt/trustdb.gpg --keyring /etc/apt/trusted.gpg --primary-keyring /etc/apt/trusted.gpg --fetch-keys http://emisoft.web.cern.ch/emisoft/dist/EMI/3/RPM-GPG-KEY-emi
gpgkeys: no key data found for http://emisoft.web.cern.ch/emisoft/dist/EMI/3/RPM-GPG-KEY-emi
Hit http://ftp.cz.debian.org squeeze Release.gpg
Ign http://ftp.cz.debian.org/debian/ squeeze/main Translation-en
Hit http://ftp.cz.debian.org squeeze-updates Release.gpg
Ign http://ftp.cz.debian.org/debian/ squeeze-updates/main Translation-en
Hit http://ftp.cz.debian.org wheezy Release.gpg
Ign http://ftp.cz.debian.org/debian/ wheezy/main Translation-en
Hit http://ftp.cz.debian.org squeeze Release
Hit http://ftp.cz.debian.org squeeze-updates Release
Hit http://ftp.cz.debian.org wheezy Release
Hit http://security.debian.org squeeze/updates Release.gpg
Ign http://security.debian.org/ squeeze/updates/main Translation-en
Hit http://security.debian.org wheezy/updates Release.gpg
Ign http://emisoft.web.cern.ch stable Release.gpg
Ign http://security.debian.org/ wheezy/updates/main Translation-en
Hit http://security.debian.org squeeze/updates Release
Hit http://ftp.cz.debian.org squeeze/main Sources
Hit http://ftp.cz.debian.org squeeze/main amd64 Packages
Hit http://security.debian.org wheezy/updates Release
Ign http://emisoft.web.cern.ch/emisoft/dist/EMI/testing/3/debian/ stable/main Translation-en
Hit http://ftp.cz.debian.org squeeze-updates/main Sources/DiffIndex
Hit http://ftp.cz.debian.org squeeze-updates/main amd64 Packages/DiffIndex
Hit http://ftp.cz.debian.org squeeze-updates/main amd64 Packages
Hit http://ftp.cz.debian.org wheezy/main Sources/DiffIndex
Hit http://repository.egi.eu egi-igtf Release.gpg
Ign http://repository.egi.eu/sw/production/cas/1/current/ egi-igtf/core Translation-en
Ign http://emisoft.web.cern.ch/emisoft/dist/EMI/testing/3/debian/ stable/third-party Translation-en
Ign http://emisoft.web.cern.ch stable Release
Hit http://ftp.cz.debian.org wheezy/main amd64 Packages/DiffIndex
Hit http://security.debian.org squeeze/updates/main Sources
Hit http://repository.egi.eu egi-igtf Release
Get:1 http://emisoft.web.cern.ch stable/main amd64 Packages [14.3 kB]
Hit http://security.debian.org squeeze/updates/main amd64 Packages
Hit http://security.debian.org wheezy/updates/main Sources
Hit http://security.debian.org wheezy/updates/main amd64 Packages
Get:2 http://emisoft.web.cern.ch stable/third-party amd64 Packages [5016 B]
Hit http://repository.egi.eu egi-igtf/core amd64 Packages
Fetched 19.3 kB in 0s (21.2 kB/s)
Reading package lists...
Reading package lists...
Building dependency tree...
Reading state information...
Reading extended state information...
Initializing package states...
Writing extended state information...
Reading task descriptions...
Couldn't find any package whose name or description matched "libcanl-c-examples"
Couldn't find any package whose name or description matched "libcanl-c-examples"
No packages will be installed, upgraded, or removed.
0 packages upgraded, 0 newly installed, 0 to remove and 105 not upgraded.
Need to get 0 B of archives. After unpacking 0 B will be used.
Writing extended state information...
Reading package lists...
Building dependency tree...
Reading state information...
Reading extended state information...
Initializing package states...
Reading task descriptions...

Tests

TestPlan N/A
Tests http://jra1mw.cvs.cern.ch/cgi-bin/jra1mw.cgi/org.glite.testsuites.ctb/CANL-C/tests/

Certificate file: none 
gLite user:       glite 
Terminal width:   80 
Output format:    -x 
Reading package lists...
Building dependency tree...
Reading state information...
cvs is already the newest version.
wget is already the newest version.
The following extra packages will be installed:
  autopoint build-essential bzip2 ca-certificates diffstat dpkg-dev g++
  g++-4.4 gettext git intltool-debian libalgorithm-diff-perl
  libalgorithm-diff-xs-perl libalgorithm-merge-perl libapt-pkg-perl
  libclass-accessor-perl libcroco3 libcurl3-gnutls libdpkg-perl liberror-perl
  libfont-afm-perl libglobus-callout0 libglobus-common0
  libglobus-gsi-callback0 libglobus-gsi-cert-utils0 libglobus-gsi-credential1
  libglobus-gsi-openssl-error0 libglobus-gsi-proxy-core0
  libglobus-gsi-proxy-ssl1 libglobus-gsi-sysconfig1 libglobus-gss-assist3
  libglobus-gssapi-gsi4 libglobus-libtool libglobus-openssl
  libglobus-openssl-module0 libhtml-format-perl libhtml-parser-perl
  libhtml-tagset-perl libhtml-template-perl libhtml-tree-perl libidn11
  libio-pty-perl libio-string-perl libipc-run-perl libltdl7 libmailtools-perl
  libparse-debianchangelog-perl libstdc++6-4.4-dev libsub-name-perl
  libtimedate-perl libunistring0 liburi-perl libvomsapi0 libwww-perl
  libxml-namespacesupport-perl libxml-parser-perl libxml-sax-expat-perl
  libxml-sax-perl libxml-simple-perl libxml2 rsync
Suggested packages:
  bzip2-doc debian-keyring g++-multilib g++-4.4-multilib gcc-4.4-doc
  libstdc++6-4.4-dbg gettext-doc git-doc git-arch git-cvs git-svn git-email
  git-daemon-run git-gui gitk gitweb libdata-dump-perl libipc-sharedcache-perl
  libstdc++6-4.4-doc libcrypt-ssleay-perl libio-socket-ssl-perl
  binutils-multiarch libtext-template-perl
The following NEW packages will be installed:
  autopoint build-essential bzip2 ca-certificates diffstat dpkg-dev g++
  g++-4.4 gettext git globus-proxy-utils intltool-debian
  libalgorithm-diff-perl libalgorithm-diff-xs-perl libalgorithm-merge-perl
  libapt-pkg-perl libclass-accessor-perl libcroco3 libcurl3-gnutls
  libdpkg-perl liberror-perl libfont-afm-perl libglobus-callout0
  libglobus-common0 libglobus-gsi-callback0 libglobus-gsi-cert-utils0
  libglobus-gsi-credential1 libglobus-gsi-openssl-error0
  libglobus-gsi-proxy-core0 libglobus-gsi-proxy-ssl1 libglobus-gsi-sysconfig1
  libglobus-gss-assist3 libglobus-gssapi-gsi4 libglobus-libtool
  libglobus-openssl libglobus-openssl-module0 libhtml-format-perl
  libhtml-parser-perl libhtml-tagset-perl libhtml-template-perl
  libhtml-tree-perl libidn11 libio-pty-perl libio-string-perl libipc-run-perl
  libltdl7 libmailtools-perl libparse-debianchangelog-perl libstdc++6-4.4-dev
  libsub-name-perl libtimedate-perl libunistring0 liburi-perl libvomsapi0
  libwww-perl libxml-namespacesupport-perl libxml-parser-perl
  libxml-sax-expat-perl libxml-sax-perl libxml-simple-perl libxml2 lintian
  lsof rsync voms-clients
0 upgraded, 65 newly installed, 0 to remove and 105 not upgraded.
Need to get 6791 kB/23.2 MB of archives.
After this operation, 64.2 MB of additional disk space will be used.
Get:1 http://ftp.cz.debian.org/debian/ squeeze/main libxml2 amd64 2.7.8.dfsg-2+squeeze5 [873 kB]
Get:2 http://ftp.cz.debian.org/debian/ squeeze/main lsof amd64 4.81.dfsg.1-1 [282 kB]
Get:3 http://ftp.cz.debian.org/debian/ squeeze/main libcurl3-gnutls amd64 7.21.0-2.1+squeeze2 [266 kB]
Get:4 http://ftp.cz.debian.org/debian/ squeeze/main libdpkg-perl all 1.15.8.13 [695 kB]
Get:5 http://ftp.cz.debian.org/debian/ squeeze/main bzip2 amd64 1.0.5-6+squeeze1 [50.5 kB]
Get:6 http://ftp.cz.debian.org/debian/ squeeze/main dpkg-dev all 1.15.8.13 [813 kB]
Get:7 http://ftp.cz.debian.org/debian/ squeeze/main diffstat amd64 1.53-1 [28.5 kB]
Get:8 http://ftp.cz.debian.org/debian/ squeeze/main libltdl7 amd64 2.2.6b-2 [296 kB]
Get:9 http://ftp.cz.debian.org/debian/ squeeze/main libglobus-libtool amd64 1.2-6 [2586 B]
Get:10 http://ftp.cz.debian.org/debian/ squeeze/main libglobus-common0 amd64 11.5-2 [105 kB]
Get:11 http://ftp.cz.debian.org/debian/ squeeze/main libglobus-callout0 amd64 0.7-6 [9264 B]
Get:12 http://ftp.cz.debian.org/debian/ squeeze/main libglobus-openssl amd64 5.1-1 [2650 B]
Get:13 http://ftp.cz.debian.org/debian/ squeeze/main libglobus-gsi-openssl-error0 amd64 0.14-6 [8372 B]
Get:14 http://ftp.cz.debian.org/debian/ squeeze/main libglobus-gsi-proxy-ssl1 amd64 2.3-1 [11.0 kB]
Get:15 http://ftp.cz.debian.org/debian/ squeeze/main libglobus-openssl-module0 amd64 1.3-1 [6488 B]
Get:16 http://ftp.cz.debian.org/debian/ squeeze/main libglobus-gsi-cert-utils0 amd64 6.6-1 [11.2 kB]
Get:17 http://ftp.cz.debian.org/debian/ squeeze/main libglobus-gsi-sysconfig1 amd64 3.1-2 [20.9 kB]
Get:18 http://ftp.cz.debian.org/debian/ squeeze/main libglobus-gsi-callback0 amd64 2.7-1 [32.2 kB]
Get:19 http://ftp.cz.debian.org/debian/ squeeze/main libglobus-gsi-credential1 amd64 3.5-1 [26.3 kB]
Get:20 http://ftp.cz.debian.org/debian/ squeeze/main libglobus-gsi-proxy-core0 amd64 4.5-1 [26.9 kB]
Get:21 http://ftp.cz.debian.org/debian/ squeeze/main libglobus-gssapi-gsi4 amd64 7.5-2 [48.7 kB]
Get:22 http://ftp.cz.debian.org/debian/ squeeze/main libglobus-gss-assist3 amd64 5.9-1 [23.6 kB]
Get:23 http://ftp.cz.debian.org/debian/ squeeze/main globus-proxy-utils amd64 3.9-1 [37.7 kB]
Get:24 http://ftp.cz.debian.org/debian/ squeeze/main libapt-pkg-perl amd64 0.1.24+b1 [91.5 kB]
Get:25 http://ftp.cz.debian.org/debian/ squeeze/main libsub-name-perl amd64 0.04-1 [10.4 kB]
Get:26 http://ftp.cz.debian.org/debian/ squeeze/main libclass-accessor-perl all 0.34-1 [25.9 kB]
Get:27 http://ftp.cz.debian.org/debian/ squeeze/main libfont-afm-perl all 1.20-1 [14.4 kB]
Get:28 http://ftp.cz.debian.org/debian/ squeeze/main liburi-perl all 1.54-2 [98.5 kB]
Get:29 http://ftp.cz.debian.org/debian/ squeeze/main libhtml-tagset-perl all 3.20-2 [13.5 kB]
Get:30 http://ftp.cz.debian.org/debian/ squeeze/main libhtml-parser-perl amd64 3.66-1 [115 kB]
Get:31 http://ftp.cz.debian.org/debian/ squeeze/main libhtml-tree-perl all 3.23-2 [209 kB]
Get:32 http://ftp.cz.debian.org/debian/ squeeze/main libhtml-format-perl all 2.04-2 [39.5 kB]
Get:33 http://ftp.cz.debian.org/debian/ squeeze/main libhtml-template-perl all 2.9-2 [65.9 kB]
Get:34 http://ftp.cz.debian.org/debian/ squeeze/main libio-pty-perl amd64 1:1.08-1 [42.5 kB]
Get:35 http://ftp.cz.debian.org/debian/ squeeze/main libio-string-perl all 1.08-2 [12.0 kB]
Get:36 http://ftp.cz.debian.org/debian/ squeeze/main libipc-run-perl all 0.89-1 [109 kB]
Get:37 http://ftp.cz.debian.org/debian/ squeeze/main libmailtools-perl all 2.06-1 [97.4 kB]
Get:38 http://ftp.cz.debian.org/debian/ squeeze/main libparse-debianchangelog-perl all 1.1.1-2.1 [60.5 kB]
Get:39 http://ftp.cz.debian.org/debian/ squeeze/main libvomsapi0 amd64 1.9.17.1-1 [433 kB]
Get:40 http://ftp.cz.debian.org/debian/ squeeze/main libwww-perl all 5.836-1 [401 kB]
Get:41 http://ftp.cz.debian.org/debian/ squeeze/main libxml-namespacesupport-perl all 1.09-3 [15.3 kB]
Get:42 http://ftp.cz.debian.org/debian/ squeeze/main libxml-parser-perl amd64 2.36-1.1+b1 [297 kB]
Get:43 http://ftp.cz.debian.org/debian/ squeeze/main libxml-sax-perl all 0.96+dfsg-2 [86.0 kB]
Get:44 http://ftp.cz.debian.org/debian/ squeeze/main libxml-sax-expat-perl all 0.40-1 [12.5 kB]
Get:45 http://ftp.cz.debian.org/debian/ squeeze/main libxml-simple-perl all 2.18-3 [72.8 kB]
Get:46 http://ftp.cz.debian.org/debian/ squeeze/main lintian all 2.4.3+squeeze1 [546 kB]
Get:47 http://ftp.cz.debian.org/debian/ squeeze/main voms-clients amd64 1.9.17.1-1 [245 kB]
Preconfiguring packages ...
Fetched 6791 kB in 0s (17.0 MB/s)
Selecting previously deselected package libidn11.
(Reading database ... 
(Reading database ... 5%
(Reading database ... 10%
(Reading database ... 15%
(Reading database ... 20%
(Reading database ... 25%
(Reading database ... 30%
(Reading database ... 35%
(Reading database ... 40%
(Reading database ... 45%
(Reading database ... 50%
(Reading database ... 55%
(Reading database ... 60%
(Reading database ... 65%
(Reading database ... 70%
(Reading database ... 75%
(Reading database ... 80%
(Reading database ... 85%
(Reading database ... 90%
(Reading database ... 95%
(Reading database ... 100%
(Reading database ... 32144 files and directories currently installed.)
Unpacking libidn11 (from .../libidn11_1.15-2_amd64.deb) ...
Selecting previously deselected package libxml2.
Unpacking libxml2 (from .../libxml2_2.7.8.dfsg-2+squeeze5_amd64.deb) ...
Selecting previously deselected package lsof.
Unpacking lsof (from .../lsof_4.81.dfsg.1-1_amd64.deb) ...
Selecting previously deselected package ca-certificates.
Unpacking ca-certificates (from .../ca-certificates_20090814+nmu3squeeze1_all.deb) ...
Selecting previously deselected package libcurl3-gnutls.
Unpacking libcurl3-gnutls (from .../libcurl3-gnutls_7.21.0-2.1+squeeze2_amd64.deb) ...
Selecting previously deselected package liberror-perl.
Unpacking liberror-perl (from .../liberror-perl_0.17-1_all.deb) ...
Selecting previously deselected package git.
Unpacking git (from .../git_1%3a1.7.2.5-3_amd64.deb) ...
Selecting previously deselected package autopoint.
Unpacking autopoint (from .../autopoint_0.18.1.1-3_all.deb) ...
Selecting previously deselected package libstdc++6-4.4-dev.
Unpacking libstdc++6-4.4-dev (from .../libstdc++6-4.4-dev_4.4.5-8_amd64.deb) ...
Selecting previously deselected package g++-4.4.
Unpacking g++-4.4 (from .../g++-4.4_4.4.5-8_amd64.deb) ...
Selecting previously deselected package g++.
Unpacking g++ (from .../g++_4%3a4.4.5-1_amd64.deb) ...
Selecting previously deselected package libtimedate-perl.
Unpacking libtimedate-perl (from .../libtimedate-perl_1.2000-1_all.deb) ...
Selecting previously deselected package libdpkg-perl.
Unpacking libdpkg-perl (from .../libdpkg-perl_1.15.8.13_all.deb) ...
Selecting previously deselected package bzip2.
Unpacking bzip2 (from .../bzip2_1.0.5-6+squeeze1_amd64.deb) ...
Selecting previously deselected package dpkg-dev.
Unpacking dpkg-dev (from .../dpkg-dev_1.15.8.13_all.deb) ...
Selecting previously deselected package build-essential.
Unpacking build-essential (from .../build-essential_11.5_amd64.deb) ...
Selecting previously deselected package diffstat.
Unpacking diffstat (from .../diffstat_1.53-1_amd64.deb) ...
Selecting previously deselected package libcroco3.
Unpacking libcroco3 (from .../libcroco3_0.6.2-1_amd64.deb) ...
Selecting previously deselected package libunistring0.
Unpacking libunistring0 (from .../libunistring0_0.9.3-3_amd64.deb) ...
Selecting previously deselected package gettext.
Unpacking gettext (from .../gettext_0.18.1.1-3_amd64.deb) ...
Selecting previously deselected package libltdl7.
Unpacking libltdl7 (from .../libltdl7_2.2.6b-2_amd64.deb) ...
Selecting previously deselected package libglobus-libtool.
Unpacking libglobus-libtool (from .../libglobus-libtool_1.2-6_amd64.deb) ...
Selecting previously deselected package libglobus-common0.
Unpacking libglobus-common0 (from .../libglobus-common0_11.5-2_amd64.deb) ...
Selecting previously deselected package libglobus-callout0.
Unpacking libglobus-callout0 (from .../libglobus-callout0_0.7-6_amd64.deb) ...
Selecting previously deselected package libglobus-openssl.
Unpacking libglobus-openssl (from .../libglobus-openssl_5.1-1_amd64.deb) ...
Selecting previously deselected package libglobus-gsi-openssl-error0.
Unpacking libglobus-gsi-openssl-error0 (from .../libglobus-gsi-openssl-error0_0.14-6_amd64.deb) ...
Selecting previously deselected package libglobus-gsi-proxy-ssl1.
Unpacking libglobus-gsi-proxy-ssl1 (from .../libglobus-gsi-proxy-ssl1_2.3-1_amd64.deb) ...
Selecting previously deselected package libglobus-openssl-module0.
Unpacking libglobus-openssl-module0 (from .../libglobus-openssl-module0_1.3-1_amd64.deb) ...
Selecting previously deselected package libglobus-gsi-cert-utils0.
Unpacking libglobus-gsi-cert-utils0 (from .../libglobus-gsi-cert-utils0_6.6-1_amd64.deb) ...
Selecting previously deselected package libglobus-gsi-sysconfig1.
Unpacking libglobus-gsi-sysconfig1 (from .../libglobus-gsi-sysconfig1_3.1-2_amd64.deb) ...
Selecting previously deselected package libglobus-gsi-callback0.
Unpacking libglobus-gsi-callback0 (from .../libglobus-gsi-callback0_2.7-1_amd64.deb) ...
Selecting previously deselected package libglobus-gsi-credential1.
Unpacking libglobus-gsi-credential1 (from .../libglobus-gsi-credential1_3.5-1_amd64.deb) ...
Selecting previously deselected package libglobus-gsi-proxy-core0.
Unpacking libglobus-gsi-proxy-core0 (from .../libglobus-gsi-proxy-core0_4.5-1_amd64.deb) ...
Selecting previously deselected package libglobus-gssapi-gsi4.
Unpacking libglobus-gssapi-gsi4 (from .../libglobus-gssapi-gsi4_7.5-2_amd64.deb) ...
Selecting previously deselected package libglobus-gss-assist3.
Unpacking libglobus-gss-assist3 (from .../libglobus-gss-assist3_5.9-1_amd64.deb) ...
Selecting previously deselected package globus-proxy-utils.
Unpacking globus-proxy-utils (from .../globus-proxy-utils_3.9-1_amd64.deb) ...
Selecting previously deselected package intltool-debian.
Unpacking intltool-debian (from .../intltool-debian_0.35.0+20060710.1_all.deb) ...
Selecting previously deselected package libalgorithm-diff-perl.
Unpacking libalgorithm-diff-perl (from .../libalgorithm-diff-perl_1.19.02-2_all.deb) ...
Selecting previously deselected package libalgorithm-diff-xs-perl.
Unpacking libalgorithm-diff-xs-perl (from .../libalgorithm-diff-xs-perl_0.04-1_amd64.deb) ...
Selecting previously deselected package libalgorithm-merge-perl.
Unpacking libalgorithm-merge-perl (from .../libalgorithm-merge-perl_0.08-2_all.deb) ...
Selecting previously deselected package libapt-pkg-perl.
Unpacking libapt-pkg-perl (from .../libapt-pkg-perl_0.1.24+b1_amd64.deb) ...
Selecting previously deselected package libsub-name-perl.
Unpacking libsub-name-perl (from .../libsub-name-perl_0.04-1_amd64.deb) ...
Selecting previously deselected package libclass-accessor-perl.
Unpacking libclass-accessor-perl (from .../libclass-accessor-perl_0.34-1_all.deb) ...
Selecting previously deselected package libfont-afm-perl.
Unpacking libfont-afm-perl (from .../libfont-afm-perl_1.20-1_all.deb) ...
Selecting previously deselected package liburi-perl.
Unpacking liburi-perl (from .../liburi-perl_1.54-2_all.deb) ...
Selecting previously deselected package libhtml-tagset-perl.
Unpacking libhtml-tagset-perl (from .../libhtml-tagset-perl_3.20-2_all.deb) ...
Selecting previously deselected package libhtml-parser-perl.
Unpacking libhtml-parser-perl (from .../libhtml-parser-perl_3.66-1_amd64.deb) ...
Selecting previously deselected package libhtml-tree-perl.
Unpacking libhtml-tree-perl (from .../libhtml-tree-perl_3.23-2_all.deb) ...
Selecting previously deselected package libhtml-format-perl.
Unpacking libhtml-format-perl (from .../libhtml-format-perl_2.04-2_all.deb) ...
Selecting previously deselected package libhtml-template-perl.
Unpacking libhtml-template-perl (from .../libhtml-template-perl_2.9-2_all.deb) ...
Selecting previously deselected package libio-pty-perl.
Unpacking libio-pty-perl (from .../libio-pty-perl_1%3a1.08-1_amd64.deb) ...
Selecting previously deselected package libio-string-perl.
Unpacking libio-string-perl (from .../libio-string-perl_1.08-2_all.deb) ...
Selecting previously deselected package libipc-run-perl.
Unpacking libipc-run-perl (from .../libipc-run-perl_0.89-1_all.deb) ...
Selecting previously deselected package libmailtools-perl.
Unpacking libmailtools-perl (from .../libmailtools-perl_2.06-1_all.deb) ...
Selecting previously deselected package libparse-debianchangelog-perl.
Unpacking libparse-debianchangelog-perl (from .../libparse-debianchangelog-perl_1.1.1-2.1_all.deb) ...
Selecting previously deselected package libvomsapi0.
Unpacking libvomsapi0 (from .../libvomsapi0_1.9.17.1-1_amd64.deb) ...
Selecting previously deselected package libwww-perl.
Unpacking libwww-perl (from .../libwww-perl_5.836-1_all.deb) ...
Selecting previously deselected package libxml-namespacesupport-perl.
Unpacking libxml-namespacesupport-perl (from .../libxml-namespacesupport-perl_1.09-3_all.deb) ...
Selecting previously deselected package libxml-parser-perl.
Unpacking libxml-parser-perl (from .../libxml-parser-perl_2.36-1.1+b1_amd64.deb) ...
Selecting previously deselected package libxml-sax-perl.
Unpacking libxml-sax-perl (from .../libxml-sax-perl_0.96+dfsg-2_all.deb) ...
Selecting previously deselected package libxml-sax-expat-perl.
Unpacking libxml-sax-expat-perl (from .../libxml-sax-expat-perl_0.40-1_all.deb) ...
Selecting previously deselected package libxml-simple-perl.
Unpacking libxml-simple-perl (from .../libxml-simple-perl_2.18-3_all.deb) ...
Selecting previously deselected package lintian.
Unpacking lintian (from .../lintian_2.4.3+squeeze1_all.deb) ...
Selecting previously deselected package rsync.
Unpacking rsync (from .../rsync_3.0.7-2_amd64.deb) ...
Selecting previously deselected package voms-clients.
Unpacking voms-clients (from .../voms-clients_1.9.17.1-1_amd64.deb) ...
Processing triggers for man-db ...
Processing triggers for install-info ...
Setting up libidn11 (1.15-2) ...
Setting up libxml2 (2.7.8.dfsg-2+squeeze5) ...
Setting up lsof (4.81.dfsg.1-1) ...
Setting up ca-certificates (20090814+nmu3squeeze1) ...
Updating certificates in /etc/ssl/certs... WARNING: Skipping duplicate certificate brasil.gov.br.pem
140 added, 0 removed; done.
Running hooks in /etc/ca-certificates/update.d....done.
Setting up libcurl3-gnutls (7.21.0-2.1+squeeze2) ...
Setting up liberror-perl (0.17-1) ...
Setting up git (1:1.7.2.5-3) ...
Setting up autopoint (0.18.1.1-3) ...
Setting up libtimedate-perl (1.2000-1) ...
Setting up libdpkg-perl (1.15.8.13) ...
Setting up bzip2 (1.0.5-6+squeeze1) ...
Setting up dpkg-dev (1.15.8.13) ...
Setting up diffstat (1.53-1) ...
Setting up libcroco3 (0.6.2-1) ...
Setting up libunistring0 (0.9.3-3) ...
Setting up gettext (0.18.1.1-3) ...
Setting up libltdl7 (2.2.6b-2) ...
Setting up libglobus-libtool (1.2-6) ...
Setting up libglobus-common0 (11.5-2) ...
Setting up libglobus-callout0 (0.7-6) ...
Setting up libglobus-openssl (5.1-1) ...
Setting up libglobus-gsi-openssl-error0 (0.14-6) ...
Setting up libglobus-gsi-proxy-ssl1 (2.3-1) ...
Setting up libglobus-openssl-module0 (1.3-1) ...
Setting up libglobus-gsi-cert-utils0 (6.6-1) ...
Setting up libglobus-gsi-sysconfig1 (3.1-2) ...
Setting up libglobus-gsi-callback0 (2.7-1) ...
Setting up libglobus-gsi-credential1 (3.5-1) ...
Setting up libglobus-gsi-proxy-core0 (4.5-1) ...
Setting up libglobus-gssapi-gsi4 (7.5-2) ...
Setting up libglobus-gss-assist3 (5.9-1) ...
Setting up globus-proxy-utils (3.9-1) ...
Setting up intltool-debian (0.35.0+20060710.1) ...
Setting up libalgorithm-diff-perl (1.19.02-2) ...
Setting up libalgorithm-diff-xs-perl (0.04-1) ...
Setting up libalgorithm-merge-perl (0.08-2) ...
Setting up libapt-pkg-perl (0.1.24+b1) ...
Setting up libsub-name-perl (0.04-1) ...
Setting up libclass-accessor-perl (0.34-1) ...
Setting up libfont-afm-perl (1.20-1) ...
Setting up liburi-perl (1.54-2) ...
Setting up libhtml-tagset-perl (3.20-2) ...
Setting up libhtml-parser-perl (3.66-1) ...
Setting up libhtml-tree-perl (3.23-2) ...
Setting up libhtml-format-perl (2.04-2) ...
Setting up libhtml-template-perl (2.9-2) ...
Setting up libio-pty-perl (1:1.08-1) ...
Setting up libio-string-perl (1.08-2) ...
Setting up libipc-run-perl (0.89-1) ...
Setting up libmailtools-perl (2.06-1) ...
Setting up libparse-debianchangelog-perl (1.1.1-2.1) ...
Setting up libvomsapi0 (1.9.17.1-1) ...
Setting up libwww-perl (5.836-1) ...
Setting up libxml-namespacesupport-perl (1.09-3) ...
Setting up libxml-parser-perl (2.36-1.1+b1) ...
Setting up libxml-sax-perl (0.96+dfsg-2) ...
update-perl-sax-parsers: Registering Perl SAX parser XML::SAX::PurePerl with priority 10...
update-perl-sax-parsers: Updating overall Perl SAX parser modules info file...

Creating config file /etc/perl/XML/SAX/ParserDetails.ini with new version
Setting up libxml-sax-expat-perl (0.40-1) ...
update-perl-sax-parsers: Registering Perl SAX parser XML::SAX::Expat with priority 50...
update-perl-sax-parsers: Updating overall Perl SAX parser modules info file...
Replacing config file /etc/perl/XML/SAX/ParserDetails.ini with new version
Setting up libxml-simple-perl (2.18-3) ...
Setting up lintian (2.4.3+squeeze1) ...
Generating en_US.UTF-8 locale for internal Lintian use....
Setting up rsync (3.0.7-2) ...
Setting up voms-clients (1.9.17.1-1) ...
Setting up libstdc++6-4.4-dev (4.4.5-8) ...
Setting up g++-4.4 (4.4.5-8) ...
Setting up g++ (4:4.4.5-1) ...
update-alternatives: using /usr/bin/g++ to provide /usr/bin/c++ (c++) in auto mode.
Setting up build-essential (11.5) ...
`/tmp/test-certs.root/grid-security/certificates/2537774a.0' -> `/etc/grid-security/certificates/2537774a.0'
`/tmp/test-certs.root/grid-security/certificates/2537774a.namespaces' -> `/etc/grid-security/certificates/2537774a.namespaces'
`/tmp/test-certs.root/grid-security/certificates/2537774a.r0' -> `/etc/grid-security/certificates/2537774a.r0'
`/tmp/test-certs.root/grid-security/certificates/2537774a.signing_policy' -> `/etc/grid-security/certificates/2537774a.signing_policy'
`/tmp/test-certs.root/grid-security/certificates/2d0b98c8.0' -> `/etc/grid-security/certificates/2d0b98c8.0'
`/tmp/test-certs.root/grid-security/certificates/2d0b98c8.namespaces' -> `/etc/grid-security/certificates/2d0b98c8.namespaces'
`/tmp/test-certs.root/grid-security/certificates/2d0b98c8.r0' -> `/etc/grid-security/certificates/2d0b98c8.r0'
`/tmp/test-certs.root/grid-security/certificates/2d0b98c8.signing_policy' -> `/etc/grid-security/certificates/2d0b98c8.signing_policy'
`/tmp/test-certs.root/grid-security/certificates/2ed6e90e.0' -> `/etc/grid-security/certificates/2ed6e90e.0'
`/tmp/test-certs.root/grid-security/certificates/2ed6e90e.namespaces' -> `/etc/grid-security/certificates/2ed6e90e.namespaces'
`/tmp/test-certs.root/grid-security/certificates/2ed6e90e.r0' -> `/etc/grid-security/certificates/2ed6e90e.r0'
`/tmp/test-certs.root/grid-security/certificates/2ed6e90e.signing_policy' -> `/etc/grid-security/certificates/2ed6e90e.signing_policy'
`/tmp/test-certs.root/grid-security/certificates/4f537285.0' -> `/etc/grid-security/certificates/4f537285.0'
`/tmp/test-certs.root/grid-security/certificates/4f537285.namespaces' -> `/etc/grid-security/certificates/4f537285.namespaces'
`/tmp/test-certs.root/grid-security/certificates/4f537285.r0' -> `/etc/grid-security/certificates/4f537285.r0'
`/tmp/test-certs.root/grid-security/certificates/4f537285.signing_policy' -> `/etc/grid-security/certificates/4f537285.signing_policy'
`/tmp/test-certs.root/grid-security/certificates/5a762d74.0' -> `/etc/grid-security/certificates/5a762d74.0'
`/tmp/test-certs.root/grid-security/certificates/5a762d74.namespaces' -> `/etc/grid-security/certificates/5a762d74.namespaces'
`/tmp/test-certs.root/grid-security/certificates/5a762d74.r0' -> `/etc/grid-security/certificates/5a762d74.r0'
`/tmp/test-certs.root/grid-security/certificates/5a762d74.signing_policy' -> `/etc/grid-security/certificates/5a762d74.signing_policy'
`/tmp/test-certs.root/grid-security/certificates/674ee20e.0' -> `/etc/grid-security/certificates/674ee20e.0'
`/tmp/test-certs.root/grid-security/certificates/674ee20e.namespaces' -> `/etc/grid-security/certificates/674ee20e.namespaces'
`/tmp/test-certs.root/grid-security/certificates/674ee20e.r0' -> `/etc/grid-security/certificates/674ee20e.r0'
`/tmp/test-certs.root/grid-security/certificates/674ee20e.signing_policy' -> `/etc/grid-security/certificates/674ee20e.signing_policy'
`/tmp/test-certs.root/grid-security/certificates/6adfad54.0' -> `/etc/grid-security/certificates/6adfad54.0'
`/tmp/test-certs.root/grid-security/certificates/6adfad54.namespaces' -> `/etc/grid-security/certificates/6adfad54.namespaces'
`/tmp/test-certs.root/grid-security/certificates/6adfad54.r0' -> `/etc/grid-security/certificates/6adfad54.r0'
`/tmp/test-certs.root/grid-security/certificates/6adfad54.signing_policy' -> `/etc/grid-security/certificates/6adfad54.signing_policy'
`/tmp/test-certs.root/grid-security/certificates/84d6f82e.0' -> `/etc/grid-security/certificates/84d6f82e.0'
`/tmp/test-certs.root/grid-security/certificates/84d6f82e.namespaces' -> `/etc/grid-security/certificates/84d6f82e.namespaces'
`/tmp/test-certs.root/grid-security/certificates/84d6f82e.r0' -> `/etc/grid-security/certificates/84d6f82e.r0'
`/tmp/test-certs.root/grid-security/certificates/84d6f82e.signing_policy' -> `/etc/grid-security/certificates/84d6f82e.signing_policy'
`/tmp/test-certs.root/grid-security/certificates/eb7d4f6b.0' -> `/etc/grid-security/certificates/eb7d4f6b.0'
`/tmp/test-certs.root/grid-security/certificates/eb7d4f6b.namespaces' -> `/etc/grid-security/certificates/eb7d4f6b.namespaces'
`/tmp/test-certs.root/grid-security/certificates/eb7d4f6b.r0' -> `/etc/grid-security/certificates/eb7d4f6b.r0'
`/tmp/test-certs.root/grid-security/certificates/eb7d4f6b.signing_policy' -> `/etc/grid-security/certificates/eb7d4f6b.signing_policy'
U org.glite.testsuites.ctb/CANL-C/tests/Makefile
U org.glite.testsuites.ctb/CANL-C/tests/canl-autonomous-test.sh
U org.glite.testsuites.ctb/CANL-C/tests/canl-common-testbeds.sh
U org.glite.testsuites.ctb/CANL-C/tests/canl-common.sh
U org.glite.testsuites.ctb/CANL-C/tests/canl-generate-fake-proxy.sh
U org.glite.testsuites.ctb/CANL-C/tests/canl-test-cert-handle.sh
U org.glite.testsuites.ctb/CANL-C/tests/canl-test-cs-openssl.sh
U org.glite.testsuites.ctb/CANL-C/tests/canl-test-sec-connection.sh
U org.glite.testsuites.ctb/CANL-C/tests/canl-test-sha2.sh
U org.glite.testsuites.ctb/CANL-C/tests/test-common.sh
========================
  REAL TESTS START HERE
========================
Nov 11 01:01:04 skirit79-2.ics.muni.cz canl-test-cert-handle.sh:    start
Testing if binary of canl_proxy_init is available Error: emi-canl-proxy-init not found
   -TEST FAILED-
Downloading canl source files and building examples   -TEST FAILED-
   -TEST FAILED-
Nov 11 01:01:04 skirit79-2.ics.muni.cz canl-test-cert-handle.sh:    end
Nov 11 01:01:04 skirit79-2.ics.muni.cz canl-test-cs-openssl.sh:    start
Testing if binaries of canl examples are available Error: emi-canl-server not found
Error: emi-canl-client not found
   -TEST FAILED-
Downloading canl source files and building examples   -TEST FAILED-
   -TEST FAILED-
Nov 11 01:01:05 skirit79-2.ics.muni.cz canl-test-cs-openssl.sh:    end
Nov 11 01:01:05 skirit79-2.ics.muni.cz canl-test-sec-connection.sh:    start
Testing if binaries of canl examples are available Error: emi-canl-server not found
Error: emi-canl-client not found
   -TEST FAILED-
Downloading canl source files and building examples   -TEST FAILED-
   -TEST FAILED-
Nov 11 01:01:06 skirit79-2.ics.muni.cz canl-test-sec-connection.sh:    end
==================
  TESTS END HERE
==================

Clean installation, Scientific 5 (i386)

Environment

Clean installation according to EMI guidelines (CA certificates, proxy certificate...).

OS Issue Scientific Linux release 5.8 (Boron)
Platform i386
Host skirit77-2.ics.muni.cz
Duration 0 min
Testbed uptime 00:47:25 up 6 min,  0 users,  load average: 0.95, 0.71, 0.31

rpm -ivh http://dl.fedoraproject.org/pub/epel/5/i386/epel-release-5-4.noarch.rpm yum install -y yum-priorities yum-protectbase rpm -ivh http://emisoft.web.cern.ch/emisoft/dist/EMI/testing/3/sl5/i386/base/emi-release-3.0.0-1.el5.noarch.rpm for i in base updates third-party contribs; do sed -i 's,/EMI/3/sl5/,/EMI/testing/3/sl5/,' /etc/yum.repos.d/emi3-$i.repo; done

yum install -y --nogpgcheck canl-c canl-c-examples

Full Output of the Installation

Retrieving http://dl.fedoraproject.org/pub/epel/5/i386/epel-release-5-4.noarch.rpm
Preparing...                ##################################################
epel-release                ##################################################
Loaded plugins: downloadonly, kernel-module
Excluding Packages from SL 5 base
Finished
Reducing SL 5 base jdk to included packages only
Finished
Excluding Packages from SL 5 security updates
Finished
Reducing SL 5 security updates jdk only to included packages only
Finished
Setting up Install Process
Resolving Dependencies
--> Running transaction check
---> Package yum-priorities.noarch 0:1.1.16-21.el5 set to be updated
---> Package yum-protectbase.noarch 0:1.1.16-21.el5 set to be updated
--> Finished Dependency Resolution
Beginning Kernel Module Plugin
Finished Kernel Module Plugin

Dependencies Resolved

================================================================================
 Package                Arch          Version              Repository      Size
================================================================================
Installing:
 yum-priorities         noarch        1.1.16-21.el5        sl-base         16 k
 yum-protectbase        noarch        1.1.16-21.el5        sl-base         14 k

Transaction Summary
================================================================================
Install       2 Package(s)
Upgrade       0 Package(s)

Total download size: 29 k
Downloading Packages:
--------------------------------------------------------------------------------
Total                                           183 kB/s |  29 kB     00:00     
Running rpm_check_debug
Running Transaction Test
Finished Transaction Test
Transaction Test Succeeded
Running Transaction

  Installing     : yum-protectbase                                          1/2 

  Installing     : yum-priorities                                           2/2 

Installed:
  yum-priorities.noarch 0:1.1.16-21.el5  yum-protectbase.noarch 0:1.1.16-21.el5 

Complete!
Retrieving http://emisoft.web.cern.ch/emisoft/dist/EMI/testing/3/sl5/i386/base/emi-release-3.0.0-1.el5.noarch.rpm
Preparing...                ##################################################
emi-release                 ##################################################
Loaded plugins: downloadonly, kernel-module, priorities, protectbase
Excluding Packages from SL 5 base
Finished
Reducing SL 5 base jdk to included packages only
Finished
Excluding Packages from SL 5 security updates
Finished
Reducing SL 5 security updates jdk only to included packages only
Finished
204 packages excluded due to repository priority protections
0 packages excluded due to repository protections
Setting up Install Process
Resolving Dependencies
--> Running transaction check
---> Package canl-c.i386 0:2.0.1-1.el5 set to be updated
--> Processing Dependency: libcares.so.2 for package: canl-c
---> Package canl-c-examples.i386 0:2.0.1-1.el5 set to be updated
--> Running transaction check
---> Package c-ares.i386 0:1.6.0-5.el5 set to be updated
--> Finished Dependency Resolution
Beginning Kernel Module Plugin
Finished Kernel Module Plugin

Dependencies Resolved

================================================================================
 Package                Arch        Version             Repository         Size
================================================================================
Installing:
 canl-c                 i386        2.0.1-1.el5         EMI-3-base         60 k
 canl-c-examples        i386        2.0.1-1.el5         EMI-3-base         11 k
Installing for dependencies:
 c-ares                 i386        1.6.0-5.el5         sl-base            49 k

Transaction Summary
================================================================================
Install       3 Package(s)
Upgrade       0 Package(s)

Total download size: 120 k
Downloading Packages:
--------------------------------------------------------------------------------
Total                                           294 kB/s | 120 kB     00:00     
Running rpm_check_debug
Running Transaction Test
Finished Transaction Test
Transaction Test Succeeded
Running Transaction

  Installing     : c-ares                                                   1/3 

  Installing     : canl-c                                                   2/3 

  Installing     : canl-c-examples                                          3/3 

Installed:
  canl-c.i386 0:2.0.1-1.el5          canl-c-examples.i386 0:2.0.1-1.el5         

Dependency Installed:
  c-ares.i386 0:1.6.0-5.el5                                                     

Complete!

Tests

TestPlan N/A
Tests http://jra1mw.cvs.cern.ch/cgi-bin/jra1mw.cgi/org.glite.testsuites.ctb/CANL-C/tests/

Certificate file: none 
gLite user:       glite 
Terminal width:   80 
Output format:    -x 
Package wget-1.11.4-3.el5_8.1.i386 already installed and latest version
Package lsof-4.78-6.i386 already installed and latest version
Package cvs-1.11.22-11.el5_8.1.i386 already installed and latest version
`/tmp/test-certs.root/grid-security/certificates/2537774a.0' -> `/etc/grid-security/certificates/2537774a.0'
`/tmp/test-certs.root/grid-security/certificates/2537774a.namespaces' -> `/etc/grid-security/certificates/2537774a.namespaces'
`/tmp/test-certs.root/grid-security/certificates/2537774a.r0' -> `/etc/grid-security/certificates/2537774a.r0'
`/tmp/test-certs.root/grid-security/certificates/2537774a.signing_policy' -> `/etc/grid-security/certificates/2537774a.signing_policy'
`/tmp/test-certs.root/grid-security/certificates/2d0b98c8.0' -> `/etc/grid-security/certificates/2d0b98c8.0'
`/tmp/test-certs.root/grid-security/certificates/2d0b98c8.namespaces' -> `/etc/grid-security/certificates/2d0b98c8.namespaces'
`/tmp/test-certs.root/grid-security/certificates/2d0b98c8.r0' -> `/etc/grid-security/certificates/2d0b98c8.r0'
`/tmp/test-certs.root/grid-security/certificates/2d0b98c8.signing_policy' -> `/etc/grid-security/certificates/2d0b98c8.signing_policy'
`/tmp/test-certs.root/grid-security/certificates/2ed6e90e.0' -> `/etc/grid-security/certificates/2ed6e90e.0'
`/tmp/test-certs.root/grid-security/certificates/2ed6e90e.namespaces' -> `/etc/grid-security/certificates/2ed6e90e.namespaces'
`/tmp/test-certs.root/grid-security/certificates/2ed6e90e.r0' -> `/etc/grid-security/certificates/2ed6e90e.r0'
`/tmp/test-certs.root/grid-security/certificates/2ed6e90e.signing_policy' -> `/etc/grid-security/certificates/2ed6e90e.signing_policy'
`/tmp/test-certs.root/grid-security/certificates/4f537285.0' -> `/etc/grid-security/certificates/4f537285.0'
`/tmp/test-certs.root/grid-security/certificates/4f537285.namespaces' -> `/etc/grid-security/certificates/4f537285.namespaces'
`/tmp/test-certs.root/grid-security/certificates/4f537285.r0' -> `/etc/grid-security/certificates/4f537285.r0'
`/tmp/test-certs.root/grid-security/certificates/4f537285.signing_policy' -> `/etc/grid-security/certificates/4f537285.signing_policy'
`/tmp/test-certs.root/grid-security/certificates/5a762d74.0' -> `/etc/grid-security/certificates/5a762d74.0'
`/tmp/test-certs.root/grid-security/certificates/5a762d74.namespaces' -> `/etc/grid-security/certificates/5a762d74.namespaces'
`/tmp/test-certs.root/grid-security/certificates/5a762d74.r0' -> `/etc/grid-security/certificates/5a762d74.r0'
`/tmp/test-certs.root/grid-security/certificates/5a762d74.signing_policy' -> `/etc/grid-security/certificates/5a762d74.signing_policy'
`/tmp/test-certs.root/grid-security/certificates/674ee20e.0' -> `/etc/grid-security/certificates/674ee20e.0'
`/tmp/test-certs.root/grid-security/certificates/674ee20e.namespaces' -> `/etc/grid-security/certificates/674ee20e.namespaces'
`/tmp/test-certs.root/grid-security/certificates/674ee20e.r0' -> `/etc/grid-security/certificates/674ee20e.r0'
`/tmp/test-certs.root/grid-security/certificates/674ee20e.signing_policy' -> `/etc/grid-security/certificates/674ee20e.signing_policy'
`/tmp/test-certs.root/grid-security/certificates/6adfad54.0' -> `/etc/grid-security/certificates/6adfad54.0'
`/tmp/test-certs.root/grid-security/certificates/6adfad54.namespaces' -> `/etc/grid-security/certificates/6adfad54.namespaces'
`/tmp/test-certs.root/grid-security/certificates/6adfad54.r0' -> `/etc/grid-security/certificates/6adfad54.r0'
`/tmp/test-certs.root/grid-security/certificates/6adfad54.signing_policy' -> `/etc/grid-security/certificates/6adfad54.signing_policy'
`/tmp/test-certs.root/grid-security/certificates/84d6f82e.0' -> `/etc/grid-security/certificates/84d6f82e.0'
`/tmp/test-certs.root/grid-security/certificates/84d6f82e.namespaces' -> `/etc/grid-security/certificates/84d6f82e.namespaces'
`/tmp/test-certs.root/grid-security/certificates/84d6f82e.r0' -> `/etc/grid-security/certificates/84d6f82e.r0'
`/tmp/test-certs.root/grid-security/certificates/84d6f82e.signing_policy' -> `/etc/grid-security/certificates/84d6f82e.signing_policy'
`/tmp/test-certs.root/grid-security/certificates/eb7d4f6b.0' -> `/etc/grid-security/certificates/eb7d4f6b.0'
`/tmp/test-certs.root/grid-security/certificates/eb7d4f6b.namespaces' -> `/etc/grid-security/certificates/eb7d4f6b.namespaces'
`/tmp/test-certs.root/grid-security/certificates/eb7d4f6b.r0' -> `/etc/grid-security/certificates/eb7d4f6b.r0'
`/tmp/test-certs.root/grid-security/certificates/eb7d4f6b.signing_policy' -> `/etc/grid-security/certificates/eb7d4f6b.signing_policy'
U org.glite.testsuites.ctb/CANL-C/tests/Makefile
U org.glite.testsuites.ctb/CANL-C/tests/canl-autonomous-test.sh
U org.glite.testsuites.ctb/CANL-C/tests/canl-common-testbeds.sh
U org.glite.testsuites.ctb/CANL-C/tests/canl-common.sh
U org.glite.testsuites.ctb/CANL-C/tests/canl-generate-fake-proxy.sh
U org.glite.testsuites.ctb/CANL-C/tests/canl-test-cert-handle.sh
U org.glite.testsuites.ctb/CANL-C/tests/canl-test-cs-openssl.sh
U org.glite.testsuites.ctb/CANL-C/tests/canl-test-sec-connection.sh
U org.glite.testsuites.ctb/CANL-C/tests/canl-test-sha2.sh
U org.glite.testsuites.ctb/CANL-C/tests/test-common.sh
========================
  REAL TESTS START HERE
========================
Nov 11 00:47:03 skirit77-2.ics.muni.cz canl-test-cert-handle.sh:    start
Testing if binary of canl_proxy_init is available   done
Testing if all binaries are available   done
Generating new proxy certificate    done
Simulating cert. delegation    done
Nov 11 00:47:03 skirit77-2.ics.muni.cz canl-test-cert-handle.sh:    end
Nov 11 00:47:03 skirit77-2.ics.muni.cz canl-test-cs-openssl.sh:    start
Testing if binaries of canl examples are available   done
Testing if all binaries are available   done
Testing credentials   done
Starting openssl server    done
CANL client: connecting to openssl server This is the testing message to send?   done
Starting canl sample server    done
Openssl client: connect to CANL sample server This is a testing message to send?   done
Nov 11 00:47:13 skirit77-2.ics.muni.cz canl-test-cs-openssl.sh:    end
Nov 11 00:47:13 skirit77-2.ics.muni.cz canl-test-sec-connection.sh:    start
Testing if binaries of canl examples are available   done
Testing if all binaries are available   done
Testing credentials   done
Testing server with nonexisting host certificates   done
Testing server with nonexisting host key   done
Testing server with nonexisting host cert and key   done
Testing client: connect to server not running   done
Testing client: use nonexisting proxy certificate   done
Starting canl sample server    done
CANL client: connect to CANL sample server server: waiting for connections... [SERVER] connection established with (null) [SERVER] Trying to send sth to the client [SERVER] message "This is a testing message to send" sent successfully [SERVER] received: This is the testing message to send    done
Nov 11 00:47:14 skirit77-2.ics.muni.cz canl-test-sec-connection.sh:    end
==================
  TESTS END HERE
==================

Clean installation, Scientific 5 (x86_64)

Environment

Clean installation according to EMI guidelines (CA certificates, proxy certificate...).

OS Issue Scientific Linux release 5.8 (Boron)
Platform x86_64
Host skirit79-2.ics.muni.cz
Duration 0 min
Testbed uptime 00:43:21 up 5 min,  0 users,  load average: 0.89, 0.57, 0.23

rpm -ivh http://dl.fedoraproject.org/pub/epel/5/x86_64/epel-release-5-4.noarch.rpm yum install -y yum-priorities yum-protectbase rpm -ivh http://emisoft.web.cern.ch/emisoft/dist/EMI/testing/3/sl5/x86_64/base/emi-release-3.0.0-1.el5.noarch.rpm for i in base updates third-party contribs; do sed -i 's,/EMI/3/sl5/,/EMI/testing/3/sl5/,' /etc/yum.repos.d/emi3-$i.repo; done

yum install -y --nogpgcheck canl-c canl-c-examples

Full Output of the Installation

Retrieving http://dl.fedoraproject.org/pub/epel/5/x86_64/epel-release-5-4.noarch.rpm
Preparing...                ##################################################
epel-release                ##################################################
Loaded plugins: downloadonly, kernel-module
Excluding Packages from SL 5 base
Finished
Reducing SL 5 base jdk to included packages only
Finished
Excluding Packages from SL 5 security updates
Finished
Reducing SL 5 security updates jdk only to included packages only
Finished
Setting up Install Process
Resolving Dependencies
--> Running transaction check
---> Package yum-priorities.noarch 0:1.1.16-21.el5 set to be updated
---> Package yum-protectbase.noarch 0:1.1.16-21.el5 set to be updated
--> Finished Dependency Resolution
Beginning Kernel Module Plugin
Finished Kernel Module Plugin

Dependencies Resolved

================================================================================
 Package                Arch          Version              Repository      Size
================================================================================
Installing:
 yum-priorities         noarch        1.1.16-21.el5        sl-base         16 k
 yum-protectbase        noarch        1.1.16-21.el5        sl-base         14 k

Transaction Summary
================================================================================
Install       2 Package(s)
Upgrade       0 Package(s)

Total download size: 29 k
Downloading Packages:
--------------------------------------------------------------------------------
Total                                           126 kB/s |  29 kB     00:00     
Running rpm_check_debug
Running Transaction Test
Finished Transaction Test
Transaction Test Succeeded
Running Transaction

  Installing     : yum-protectbase                                          1/2 

  Installing     : yum-priorities                                           2/2 

Installed:
  yum-priorities.noarch 0:1.1.16-21.el5  yum-protectbase.noarch 0:1.1.16-21.el5 

Complete!
Retrieving http://emisoft.web.cern.ch/emisoft/dist/EMI/testing/3/sl5/x86_64/base/emi-release-3.0.0-1.el5.noarch.rpm
Preparing...                ##################################################
emi-release                 ##################################################
Loaded plugins: downloadonly, kernel-module, priorities, protectbase
Excluding Packages from SL 5 base
Finished
Reducing SL 5 base jdk to included packages only
Finished
Excluding Packages from SL 5 security updates
Finished
Reducing SL 5 security updates jdk only to included packages only
Finished
308 packages excluded due to repository priority protections
0 packages excluded due to repository protections
Setting up Install Process
Resolving Dependencies
--> Running transaction check
---> Package canl-c.i386 0:2.0.1-1.el5 set to be updated
--> Processing Dependency: libcares.so.2 for package: canl-c
---> Package canl-c.x86_64 0:2.0.1-1.el5 set to be updated
--> Processing Dependency: libcares.so.2()(64bit) for package: canl-c
---> Package canl-c-examples.x86_64 0:2.0.1-1.el5 set to be updated
--> Running transaction check
---> Package c-ares.i386 0:1.6.0-5.el5 set to be updated
---> Package c-ares.x86_64 0:1.6.0-5.el5 set to be updated
--> Finished Dependency Resolution
Beginning Kernel Module Plugin
Finished Kernel Module Plugin

Dependencies Resolved

================================================================================
 Package               Arch         Version              Repository        Size
================================================================================
Installing:
 canl-c                i386         2.0.1-1.el5          EMI-3-base        60 k
 canl-c                x86_64       2.0.1-1.el5          EMI-3-base        67 k
 canl-c-examples       x86_64       2.0.1-1.el5          EMI-3-base        12 k
Installing for dependencies:
 c-ares                i386         1.6.0-5.el5          sl-base           49 k
 c-ares                x86_64       1.6.0-5.el5          sl-base           49 k

Transaction Summary
================================================================================
Install       5 Package(s)
Upgrade       0 Package(s)

Total download size: 237 k
Downloading Packages:
--------------------------------------------------------------------------------
Total                                           301 kB/s | 237 kB     00:00     
Running rpm_check_debug
Running Transaction Test
Finished Transaction Test
Transaction Test Succeeded
Running Transaction

  Installing     : c-ares                                                   1/5 

  Installing     : canl-c                                                   2/5 

  Installing     : c-ares                                                   3/5 

  Installing     : canl-c                                                   4/5 

  Installing     : canl-c-examples                                          5/5 

Installed:
  canl-c.i386 0:2.0.1-1.el5                   canl-c.x86_64 0:2.0.1-1.el5       
  canl-c-examples.x86_64 0:2.0.1-1.el5       

Dependency Installed:
  c-ares.i386 0:1.6.0-5.el5             c-ares.x86_64 0:1.6.0-5.el5            

Complete!

Tests

TestPlan N/A
Tests http://jra1mw.cvs.cern.ch/cgi-bin/jra1mw.cgi/org.glite.testsuites.ctb/CANL-C/tests/

Certificate file: none 
gLite user:       glite 
Terminal width:   80 
Output format:    -x 
Package wget-1.11.4-3.el5_8.1.x86_64 already installed and latest version
Package lsof-4.78-6.x86_64 already installed and latest version
Package cvs-1.11.22-11.el5_8.1.x86_64 already installed and latest version
`/tmp/test-certs.root/grid-security/certificates/2537774a.0' -> `/etc/grid-security/certificates/2537774a.0'
`/tmp/test-certs.root/grid-security/certificates/2537774a.namespaces' -> `/etc/grid-security/certificates/2537774a.namespaces'
`/tmp/test-certs.root/grid-security/certificates/2537774a.r0' -> `/etc/grid-security/certificates/2537774a.r0'
`/tmp/test-certs.root/grid-security/certificates/2537774a.signing_policy' -> `/etc/grid-security/certificates/2537774a.signing_policy'
`/tmp/test-certs.root/grid-security/certificates/2d0b98c8.0' -> `/etc/grid-security/certificates/2d0b98c8.0'
`/tmp/test-certs.root/grid-security/certificates/2d0b98c8.namespaces' -> `/etc/grid-security/certificates/2d0b98c8.namespaces'
`/tmp/test-certs.root/grid-security/certificates/2d0b98c8.r0' -> `/etc/grid-security/certificates/2d0b98c8.r0'
`/tmp/test-certs.root/grid-security/certificates/2d0b98c8.signing_policy' -> `/etc/grid-security/certificates/2d0b98c8.signing_policy'
`/tmp/test-certs.root/grid-security/certificates/2ed6e90e.0' -> `/etc/grid-security/certificates/2ed6e90e.0'
`/tmp/test-certs.root/grid-security/certificates/2ed6e90e.namespaces' -> `/etc/grid-security/certificates/2ed6e90e.namespaces'
`/tmp/test-certs.root/grid-security/certificates/2ed6e90e.r0' -> `/etc/grid-security/certificates/2ed6e90e.r0'
`/tmp/test-certs.root/grid-security/certificates/2ed6e90e.signing_policy' -> `/etc/grid-security/certificates/2ed6e90e.signing_policy'
`/tmp/test-certs.root/grid-security/certificates/4f537285.0' -> `/etc/grid-security/certificates/4f537285.0'
`/tmp/test-certs.root/grid-security/certificates/4f537285.namespaces' -> `/etc/grid-security/certificates/4f537285.namespaces'
`/tmp/test-certs.root/grid-security/certificates/4f537285.r0' -> `/etc/grid-security/certificates/4f537285.r0'
`/tmp/test-certs.root/grid-security/certificates/4f537285.signing_policy' -> `/etc/grid-security/certificates/4f537285.signing_policy'
`/tmp/test-certs.root/grid-security/certificates/5a762d74.0' -> `/etc/grid-security/certificates/5a762d74.0'
`/tmp/test-certs.root/grid-security/certificates/5a762d74.namespaces' -> `/etc/grid-security/certificates/5a762d74.namespaces'
`/tmp/test-certs.root/grid-security/certificates/5a762d74.r0' -> `/etc/grid-security/certificates/5a762d74.r0'
`/tmp/test-certs.root/grid-security/certificates/5a762d74.signing_policy' -> `/etc/grid-security/certificates/5a762d74.signing_policy'
`/tmp/test-certs.root/grid-security/certificates/674ee20e.0' -> `/etc/grid-security/certificates/674ee20e.0'
`/tmp/test-certs.root/grid-security/certificates/674ee20e.namespaces' -> `/etc/grid-security/certificates/674ee20e.namespaces'
`/tmp/test-certs.root/grid-security/certificates/674ee20e.r0' -> `/etc/grid-security/certificates/674ee20e.r0'
`/tmp/test-certs.root/grid-security/certificates/674ee20e.signing_policy' -> `/etc/grid-security/certificates/674ee20e.signing_policy'
`/tmp/test-certs.root/grid-security/certificates/6adfad54.0' -> `/etc/grid-security/certificates/6adfad54.0'
`/tmp/test-certs.root/grid-security/certificates/6adfad54.namespaces' -> `/etc/grid-security/certificates/6adfad54.namespaces'
`/tmp/test-certs.root/grid-security/certificates/6adfad54.r0' -> `/etc/grid-security/certificates/6adfad54.r0'
`/tmp/test-certs.root/grid-security/certificates/6adfad54.signing_policy' -> `/etc/grid-security/certificates/6adfad54.signing_policy'
`/tmp/test-certs.root/grid-security/certificates/84d6f82e.0' -> `/etc/grid-security/certificates/84d6f82e.0'
`/tmp/test-certs.root/grid-security/certificates/84d6f82e.namespaces' -> `/etc/grid-security/certificates/84d6f82e.namespaces'
`/tmp/test-certs.root/grid-security/certificates/84d6f82e.r0' -> `/etc/grid-security/certificates/84d6f82e.r0'
`/tmp/test-certs.root/grid-security/certificates/84d6f82e.signing_policy' -> `/etc/grid-security/certificates/84d6f82e.signing_policy'
`/tmp/test-certs.root/grid-security/certificates/eb7d4f6b.0' -> `/etc/grid-security/certificates/eb7d4f6b.0'
`/tmp/test-certs.root/grid-security/certificates/eb7d4f6b.namespaces' -> `/etc/grid-security/certificates/eb7d4f6b.namespaces'
`/tmp/test-certs.root/grid-security/certificates/eb7d4f6b.r0' -> `/etc/grid-security/certificates/eb7d4f6b.r0'
`/tmp/test-certs.root/grid-security/certificates/eb7d4f6b.signing_policy' -> `/etc/grid-security/certificates/eb7d4f6b.signing_policy'
U org.glite.testsuites.ctb/CANL-C/tests/Makefile
U org.glite.testsuites.ctb/CANL-C/tests/canl-autonomous-test.sh
U org.glite.testsuites.ctb/CANL-C/tests/canl-common-testbeds.sh
U org.glite.testsuites.ctb/CANL-C/tests/canl-common.sh
U org.glite.testsuites.ctb/CANL-C/tests/canl-generate-fake-proxy.sh
U org.glite.testsuites.ctb/CANL-C/tests/canl-test-cert-handle.sh
U org.glite.testsuites.ctb/CANL-C/tests/canl-test-cs-openssl.sh
U org.glite.testsuites.ctb/CANL-C/tests/canl-test-sec-connection.sh
U org.glite.testsuites.ctb/CANL-C/tests/canl-test-sha2.sh
U org.glite.testsuites.ctb/CANL-C/tests/test-common.sh
========================
  REAL TESTS START HERE
========================
Nov 11 00:43:00 skirit79-2.ics.muni.cz canl-test-cert-handle.sh:    start
Testing if binary of canl_proxy_init is available   done
Testing if all binaries are available   done
Generating new proxy certificate    done
Simulating cert. delegation    done
Nov 11 00:43:00 skirit79-2.ics.muni.cz canl-test-cert-handle.sh:    end
Nov 11 00:43:00 skirit79-2.ics.muni.cz canl-test-cs-openssl.sh:    start
Testing if binaries of canl examples are available   done
Testing if all binaries are available   done
Testing credentials   done
Starting openssl server    done
CANL client: connecting to openssl server This is the testing message to send?   done
Starting canl sample server    done
Openssl client: connect to CANL sample server This is a testing message to send?   done
Nov 11 00:43:10 skirit79-2.ics.muni.cz canl-test-cs-openssl.sh:    end
Nov 11 00:43:10 skirit79-2.ics.muni.cz canl-test-sec-connection.sh:    start
Testing if binaries of canl examples are available   done
Testing if all binaries are available   done
Testing credentials   done
Testing server with nonexisting host certificates   done
Testing server with nonexisting host key   done
Testing server with nonexisting host cert and key   done
Testing client: connect to server not running   done
Testing client: use nonexisting proxy certificate   done
Starting canl sample server    done
CANL client: connect to CANL sample server [CLIENT] connection established [CLIENT] Trying to send sth to the server [CLIENT] message "This is the testing message to send" sent successfully [CLIENT] received: This is a testing message to send    done
server: waiting for connections... [SERVER] connection established with (null) [SERVER] Trying to send sth to the client [SERVER] message "This is a testing message to send" sent successfully [SERVER] received: This is the testing message to send Nov 11 00:43:10 skirit79-2.ics.muni.cz canl-test-sec-connection.sh:    end
==================
  TESTS END HERE
==================

Clean installation, Scientific 6 (i386)

Environment

Clean installation according to EMI guidelines (CA certificates, proxy certificate...).

OS Issue Scientific Linux release 6.3 (Carbon)
Platform i386
Host nympha19-2.zcu.cz
Duration 0 min
Testbed uptime 02:44:45 up 6 min,  0 users,  load average: 1.10, 1.15, 0.63

rpm -ivh http://dl.fedoraproject.org/pub/epel/6/i386/epel-release-6-7.noarch.rpm yum install -y yum-priorities yum-protectbase rpm -ivh http://emisoft.web.cern.ch/emisoft/dist/EMI/testing/3/sl6/x86_64/base/emi-release-3.0.0-1.el6.noarch.rpm for i in base updates third-party contribs; do sed -i 's,/EMI/3/sl6/,/EMI/testing/3/sl6/,' /etc/yum.repos.d/emi3-$i.repo; done

yum install -y --nogpgcheck canl-c canl-c-examples

Full Output of the Installation

Retrieving http://dl.fedoraproject.org/pub/epel/6/i386/epel-release-6-7.noarch.rpm
Preparing...                ##################################################
epel-release                ##################################################
Loaded plugins: security
Setting up Install Process
Resolving Dependencies
--> Running transaction check
---> Package yum-plugin-priorities.noarch 0:1.1.30-14.el6 will be installed
---> Package yum-plugin-protectbase.noarch 0:1.1.30-14.el6 will be installed
--> Finished Dependency Resolution

Dependencies Resolved

================================================================================
 Package                      Arch         Version               Repository
                                                                           Size
================================================================================
Installing:
 yum-plugin-priorities        noarch       1.1.30-14.el6         sl        21 k
 yum-plugin-protectbase       noarch       1.1.30-14.el6         sl        19 k

Transaction Summary
================================================================================
Install       2 Package(s)

Total download size: 41 k
Installed size: 50 k
Downloading Packages:
--------------------------------------------------------------------------------
Total                                           178 kB/s |  41 kB     00:00     
Running rpm_check_debug
Running Transaction Test
Transaction Test Succeeded
Running Transaction

  Installing : yum-plugin-priorities-1.1.30-14.el6.noarch                   1/2 

  Installing : yum-plugin-protectbase-1.1.30-14.el6.noarch                  2/2 

  Verifying  : yum-plugin-protectbase-1.1.30-14.el6.noarch                  1/2 

  Verifying  : yum-plugin-priorities-1.1.30-14.el6.noarch                   2/2 

Installed:
  yum-plugin-priorities.noarch 0:1.1.30-14.el6                                  
  yum-plugin-protectbase.noarch 0:1.1.30-14.el6                                 

Complete!
Retrieving http://emisoft.web.cern.ch/emisoft/dist/EMI/testing/3/sl6/x86_64/base/emi-release-3.0.0-1.el6.noarch.rpm
Preparing...                ##################################################
emi-release                 ##################################################
Loaded plugins: priorities, protectbase, security
74 packages excluded due to repository priority protections
0 packages excluded due to repository protections
Setting up Install Process
Resolving Dependencies
--> Running transaction check
---> Package canl-c.i386 0:2.0.1-1.el6 will be installed
--> Processing Dependency: libcares.so.2 for package: canl-c-2.0.1-1.el6.i386
---> Package canl-c-examples.i386 0:2.0.1-1.el6 will be installed
--> Running transaction check
---> Package c-ares.i686 0:1.7.0-6.el6 will be installed
--> Finished Dependency Resolution

Dependencies Resolved

================================================================================
 Package                Arch        Version             Repository         Size
================================================================================
Installing:
 canl-c                 i386        2.0.1-1.el6         EMI-3-base         51 k
 canl-c-examples        i386        2.0.1-1.el6         EMI-3-base         10 k
Installing for dependencies:
 c-ares                 i686        1.7.0-6.el6         sl                 53 k

Transaction Summary
================================================================================
Install       3 Package(s)

Total download size: 114 k
Installed size: 287 k
Downloading Packages:
--------------------------------------------------------------------------------
Total                                           258 kB/s | 114 kB     00:00     
Running rpm_check_debug
Running Transaction Test
Transaction Test Succeeded
Running Transaction

  Installing : c-ares-1.7.0-6.el6.i686                                      1/3 

  Installing : canl-c-2.0.1-1.el6.i386                                      2/3 

  Installing : canl-c-examples-2.0.1-1.el6.i386                             3/3 

  Verifying  : c-ares-1.7.0-6.el6.i686                                      1/3 

  Verifying  : canl-c-2.0.1-1.el6.i386                                      2/3 

  Verifying  : canl-c-examples-2.0.1-1.el6.i386                             3/3 

Installed:
  canl-c.i386 0:2.0.1-1.el6          canl-c-examples.i386 0:2.0.1-1.el6         

Dependency Installed:
  c-ares.i686 0:1.7.0-6.el6                                                     

Complete!

Tests

TestPlan N/A
Tests http://jra1mw.cvs.cern.ch/cgi-bin/jra1mw.cgi/org.glite.testsuites.ctb/CANL-C/tests/

Certificate file: none 
gLite user:       glite 
Terminal width:   80 
Output format:    -x 
Package wget-1.12-1.4.el6.i686 already installed and latest version
Package lsof-4.82-4.el6.i686 already installed and latest version
Package cvs-1.11.23-11.el6_2.1.i686 already installed and latest version
`/tmp/test-certs.root/grid-security/certificates/0e2ca11d.0' -> `/etc/grid-security/certificates/0e2ca11d.0'
`/tmp/test-certs.root/grid-security/certificates/0e2ca11d.namespaces' -> `/etc/grid-security/certificates/0e2ca11d.namespaces'
`/tmp/test-certs.root/grid-security/certificates/0e2ca11d.r0' -> `/etc/grid-security/certificates/0e2ca11d.r0'
`/tmp/test-certs.root/grid-security/certificates/0e2ca11d.signing_policy' -> `/etc/grid-security/certificates/0e2ca11d.signing_policy'
`/tmp/test-certs.root/grid-security/certificates/0fbe317b.0' -> `/etc/grid-security/certificates/0fbe317b.0'
`/tmp/test-certs.root/grid-security/certificates/0fbe317b.namespaces' -> `/etc/grid-security/certificates/0fbe317b.namespaces'
`/tmp/test-certs.root/grid-security/certificates/0fbe317b.r0' -> `/etc/grid-security/certificates/0fbe317b.r0'
`/tmp/test-certs.root/grid-security/certificates/0fbe317b.signing_policy' -> `/etc/grid-security/certificates/0fbe317b.signing_policy'
`/tmp/test-certs.root/grid-security/certificates/36395d3c.0' -> `/etc/grid-security/certificates/36395d3c.0'
`/tmp/test-certs.root/grid-security/certificates/36395d3c.namespaces' -> `/etc/grid-security/certificates/36395d3c.namespaces'
`/tmp/test-certs.root/grid-security/certificates/36395d3c.r0' -> `/etc/grid-security/certificates/36395d3c.r0'
`/tmp/test-certs.root/grid-security/certificates/36395d3c.signing_policy' -> `/etc/grid-security/certificates/36395d3c.signing_policy'
`/tmp/test-certs.root/grid-security/certificates/41a90451.0' -> `/etc/grid-security/certificates/41a90451.0'
`/tmp/test-certs.root/grid-security/certificates/41a90451.namespaces' -> `/etc/grid-security/certificates/41a90451.namespaces'
`/tmp/test-certs.root/grid-security/certificates/41a90451.r0' -> `/etc/grid-security/certificates/41a90451.r0'
`/tmp/test-certs.root/grid-security/certificates/41a90451.signing_policy' -> `/etc/grid-security/certificates/41a90451.signing_policy'
`/tmp/test-certs.root/grid-security/certificates/7362bbd6.0' -> `/etc/grid-security/certificates/7362bbd6.0'
`/tmp/test-certs.root/grid-security/certificates/7362bbd6.namespaces' -> `/etc/grid-security/certificates/7362bbd6.namespaces'
`/tmp/test-certs.root/grid-security/certificates/7362bbd6.r0' -> `/etc/grid-security/certificates/7362bbd6.r0'
`/tmp/test-certs.root/grid-security/certificates/7362bbd6.signing_policy' -> `/etc/grid-security/certificates/7362bbd6.signing_policy'
`/tmp/test-certs.root/grid-security/certificates/79356fdd.0' -> `/etc/grid-security/certificates/79356fdd.0'
`/tmp/test-certs.root/grid-security/certificates/79356fdd.namespaces' -> `/etc/grid-security/certificates/79356fdd.namespaces'
`/tmp/test-certs.root/grid-security/certificates/79356fdd.r0' -> `/etc/grid-security/certificates/79356fdd.r0'
`/tmp/test-certs.root/grid-security/certificates/79356fdd.signing_policy' -> `/etc/grid-security/certificates/79356fdd.signing_policy'
`/tmp/test-certs.root/grid-security/certificates/9a529ab0.0' -> `/etc/grid-security/certificates/9a529ab0.0'
`/tmp/test-certs.root/grid-security/certificates/9a529ab0.namespaces' -> `/etc/grid-security/certificates/9a529ab0.namespaces'
`/tmp/test-certs.root/grid-security/certificates/9a529ab0.r0' -> `/etc/grid-security/certificates/9a529ab0.r0'
`/tmp/test-certs.root/grid-security/certificates/9a529ab0.signing_policy' -> `/etc/grid-security/certificates/9a529ab0.signing_policy'
`/tmp/test-certs.root/grid-security/certificates/c1d9b6d3.0' -> `/etc/grid-security/certificates/c1d9b6d3.0'
`/tmp/test-certs.root/grid-security/certificates/c1d9b6d3.namespaces' -> `/etc/grid-security/certificates/c1d9b6d3.namespaces'
`/tmp/test-certs.root/grid-security/certificates/c1d9b6d3.r0' -> `/etc/grid-security/certificates/c1d9b6d3.r0'
`/tmp/test-certs.root/grid-security/certificates/c1d9b6d3.signing_policy' -> `/etc/grid-security/certificates/c1d9b6d3.signing_policy'
`/tmp/test-certs.root/grid-security/certificates/ffb9710f.0' -> `/etc/grid-security/certificates/ffb9710f.0'
`/tmp/test-certs.root/grid-security/certificates/ffb9710f.namespaces' -> `/etc/grid-security/certificates/ffb9710f.namespaces'
`/tmp/test-certs.root/grid-security/certificates/ffb9710f.r0' -> `/etc/grid-security/certificates/ffb9710f.r0'
`/tmp/test-certs.root/grid-security/certificates/ffb9710f.signing_policy' -> `/etc/grid-security/certificates/ffb9710f.signing_policy'
U org.glite.testsuites.ctb/CANL-C/tests/Makefile
U org.glite.testsuites.ctb/CANL-C/tests/canl-autonomous-test.sh
U org.glite.testsuites.ctb/CANL-C/tests/canl-common-testbeds.sh
U org.glite.testsuites.ctb/CANL-C/tests/canl-common.sh
U org.glite.testsuites.ctb/CANL-C/tests/canl-generate-fake-proxy.sh
U org.glite.testsuites.ctb/CANL-C/tests/canl-test-cert-handle.sh
U org.glite.testsuites.ctb/CANL-C/tests/canl-test-cs-openssl.sh
U org.glite.testsuites.ctb/CANL-C/tests/canl-test-sec-connection.sh
U org.glite.testsuites.ctb/CANL-C/tests/canl-test-sha2.sh
U org.glite.testsuites.ctb/CANL-C/tests/test-common.sh
========================
  REAL TESTS START HERE
========================
Nov 11 02:44:27 nympha19-2.zcu.cz canl-test-cert-handle.sh:    start
Testing if binary of canl_proxy_init is available   done
Testing if all binaries are available   done
Generating new proxy certificate    done
Simulating cert. delegation    done
Nov 11 02:44:27 nympha19-2.zcu.cz canl-test-cert-handle.sh:    end
Nov 11 02:44:27 nympha19-2.zcu.cz canl-test-cs-openssl.sh:    start
Testing if binaries of canl examples are available   done
Testing if all binaries are available   done
Testing credentials   done
Starting openssl server    done
CANL client: connecting to openssl server This is the testing message to send?   done
Starting canl sample server    done
Openssl client: connect to CANL sample server This is a testing message to send?   done
Nov 11 02:44:37 nympha19-2.zcu.cz canl-test-cs-openssl.sh:    end
Nov 11 02:44:38 nympha19-2.zcu.cz canl-test-sec-connection.sh:    start
Testing if binaries of canl examples are available   done
Testing if all binaries are available   done
Testing credentials   done
Testing server with nonexisting host certificates   done
Testing server with nonexisting host key   done
Testing server with nonexisting host cert and key   done
Testing client: connect to server not running   done
Testing client: use nonexisting proxy certificate   done
Starting canl sample server    done
CANL client: connect to CANL sample server [CLIENT] connection established [CLIENT] Trying to send sth to the server [CLIENT] message "This is the testing message to send" sent successfully [CLIENT] received: This is a testing message to send server: waiting for connections... [SERVER] connection established with (null) [SERVER] Trying to send sth to the client [SERVER] message "This is a testing message to send" sent successfully [SERVER] received: This is the testing message to send    done
Nov 11 02:44:38 nympha19-2.zcu.cz canl-test-sec-connection.sh:    end
==================
  TESTS END HERE
==================

Clean installation, Scientific 6 (x86_64)

Environment

Clean installation according to EMI guidelines (CA certificates, proxy certificate...).

OS Issue Scientific Linux release 6.3 (Carbon)
Platform x86_64
Host nympha19-2.zcu.cz
Duration 0 min
Testbed uptime 23:29:37 up 6 min,  0 users,  load average: 0.84, 0.70, 0.34

rpm -ivh http://dl.fedoraproject.org/pub/epel/6/x86_64/epel-release-6-7.noarch.rpm yum install -y yum-priorities yum-protectbase rpm -ivh http://emisoft.web.cern.ch/emisoft/dist/EMI/testing/3/sl6/x86_64/base/emi-release-3.0.0-1.el6.noarch.rpm for i in base updates third-party contribs; do sed -i 's,/EMI/3/sl6/,/EMI/testing/3/sl6/,' /etc/yum.repos.d/emi3-$i.repo; done

yum install -y --nogpgcheck canl-c canl-c-examples

Full Output of the Installation

Retrieving http://dl.fedoraproject.org/pub/epel/6/x86_64/epel-release-6-7.noarch.rpm
Preparing...                ##################################################
epel-release                ##################################################
Loaded plugins: security
Setting up Install Process
Resolving Dependencies
--> Running transaction check
---> Package yum-plugin-priorities.noarch 0:1.1.30-14.el6 will be installed
---> Package yum-plugin-protectbase.noarch 0:1.1.30-14.el6 will be installed
--> Finished Dependency Resolution

Dependencies Resolved

================================================================================
 Package                      Arch         Version               Repository
                                                                           Size
================================================================================
Installing:
 yum-plugin-priorities        noarch       1.1.30-14.el6         sl        21 k
 yum-plugin-protectbase       noarch       1.1.30-14.el6         sl        19 k

Transaction Summary
================================================================================
Install       2 Package(s)

Total download size: 41 k
Installed size: 50 k
Downloading Packages:
--------------------------------------------------------------------------------
Total                                           225 kB/s |  41 kB     00:00     
Running rpm_check_debug
Running Transaction Test
Transaction Test Succeeded
Running Transaction

  Installing : yum-plugin-priorities-1.1.30-14.el6.noarch                   1/2 

  Installing : yum-plugin-protectbase-1.1.30-14.el6.noarch                  2/2 

  Verifying  : yum-plugin-protectbase-1.1.30-14.el6.noarch                  1/2 

  Verifying  : yum-plugin-priorities-1.1.30-14.el6.noarch                   2/2 

Installed:
  yum-plugin-priorities.noarch 0:1.1.30-14.el6                                  
  yum-plugin-protectbase.noarch 0:1.1.30-14.el6                                 

Complete!
Retrieving http://emisoft.web.cern.ch/emisoft/dist/EMI/testing/3/sl6/x86_64/base/emi-release-3.0.0-1.el6.noarch.rpm
Preparing...                ##################################################
emi-release                 ##################################################
Loaded plugins: priorities, protectbase, security
120 packages excluded due to repository priority protections
0 packages excluded due to repository protections
Setting up Install Process
Resolving Dependencies
--> Running transaction check
---> Package canl-c.x86_64 0:2.0.1-1.el6 will be installed
--> Processing Dependency: libcares.so.2()(64bit) for package: canl-c-2.0.1-1.el6.x86_64
---> Package canl-c-examples.x86_64 0:2.0.1-1.el6 will be installed
--> Running transaction check
---> Package c-ares.x86_64 0:1.7.0-6.el6 will be installed
--> Finished Dependency Resolution

Dependencies Resolved

================================================================================
 Package               Arch         Version              Repository        Size
================================================================================
Installing:
 canl-c                x86_64       2.0.1-1.el6          EMI-3-base        58 k
 canl-c-examples       x86_64       2.0.1-1.el6          EMI-3-base        10 k
Installing for dependencies:
 c-ares                x86_64       1.7.0-6.el6          sl                52 k

Transaction Summary
================================================================================
Install       3 Package(s)

Total download size: 120 k
Installed size: 337 k
Downloading Packages:
--------------------------------------------------------------------------------
Total                                           273 kB/s | 120 kB     00:00     
Running rpm_check_debug
Running Transaction Test
Transaction Test Succeeded
Running Transaction

  Installing : c-ares-1.7.0-6.el6.x86_64                                    1/3 

  Installing : canl-c-2.0.1-1.el6.x86_64                                    2/3 

  Installing : canl-c-examples-2.0.1-1.el6.x86_64                           3/3 

  Verifying  : canl-c-2.0.1-1.el6.x86_64                                    1/3 

  Verifying  : c-ares-1.7.0-6.el6.x86_64                                    2/3 

  Verifying  : canl-c-examples-2.0.1-1.el6.x86_64                           3/3 

Installed:
  canl-c.x86_64 0:2.0.1-1.el6        canl-c-examples.x86_64 0:2.0.1-1.el6       

Dependency Installed:
  c-ares.x86_64 0:1.7.0-6.el6                                                   

Complete!

Tests

TestPlan N/A
Tests http://jra1mw.cvs.cern.ch/cgi-bin/jra1mw.cgi/org.glite.testsuites.ctb/CANL-C/tests/

Certificate file: none 
gLite user:       glite 
Terminal width:   80 
Output format:    -x 
Package wget-1.12-1.4.el6.x86_64 already installed and latest version
Package cvs-1.11.23-11.el6_2.1.x86_64 already installed and latest version
`/tmp/test-certs.root/grid-security/certificates/0e2ca11d.0' -> `/etc/grid-security/certificates/0e2ca11d.0'
`/tmp/test-certs.root/grid-security/certificates/0e2ca11d.namespaces' -> `/etc/grid-security/certificates/0e2ca11d.namespaces'
`/tmp/test-certs.root/grid-security/certificates/0e2ca11d.r0' -> `/etc/grid-security/certificates/0e2ca11d.r0'
`/tmp/test-certs.root/grid-security/certificates/0e2ca11d.signing_policy' -> `/etc/grid-security/certificates/0e2ca11d.signing_policy'
`/tmp/test-certs.root/grid-security/certificates/0fbe317b.0' -> `/etc/grid-security/certificates/0fbe317b.0'
`/tmp/test-certs.root/grid-security/certificates/0fbe317b.namespaces' -> `/etc/grid-security/certificates/0fbe317b.namespaces'
`/tmp/test-certs.root/grid-security/certificates/0fbe317b.r0' -> `/etc/grid-security/certificates/0fbe317b.r0'
`/tmp/test-certs.root/grid-security/certificates/0fbe317b.signing_policy' -> `/etc/grid-security/certificates/0fbe317b.signing_policy'
`/tmp/test-certs.root/grid-security/certificates/36395d3c.0' -> `/etc/grid-security/certificates/36395d3c.0'
`/tmp/test-certs.root/grid-security/certificates/36395d3c.namespaces' -> `/etc/grid-security/certificates/36395d3c.namespaces'
`/tmp/test-certs.root/grid-security/certificates/36395d3c.r0' -> `/etc/grid-security/certificates/36395d3c.r0'
`/tmp/test-certs.root/grid-security/certificates/36395d3c.signing_policy' -> `/etc/grid-security/certificates/36395d3c.signing_policy'
`/tmp/test-certs.root/grid-security/certificates/41a90451.0' -> `/etc/grid-security/certificates/41a90451.0'
`/tmp/test-certs.root/grid-security/certificates/41a90451.namespaces' -> `/etc/grid-security/certificates/41a90451.namespaces'
`/tmp/test-certs.root/grid-security/certificates/41a90451.r0' -> `/etc/grid-security/certificates/41a90451.r0'
`/tmp/test-certs.root/grid-security/certificates/41a90451.signing_policy' -> `/etc/grid-security/certificates/41a90451.signing_policy'
`/tmp/test-certs.root/grid-security/certificates/7362bbd6.0' -> `/etc/grid-security/certificates/7362bbd6.0'
`/tmp/test-certs.root/grid-security/certificates/7362bbd6.namespaces' -> `/etc/grid-security/certificates/7362bbd6.namespaces'
`/tmp/test-certs.root/grid-security/certificates/7362bbd6.r0' -> `/etc/grid-security/certificates/7362bbd6.r0'
`/tmp/test-certs.root/grid-security/certificates/7362bbd6.signing_policy' -> `/etc/grid-security/certificates/7362bbd6.signing_policy'
`/tmp/test-certs.root/grid-security/certificates/79356fdd.0' -> `/etc/grid-security/certificates/79356fdd.0'
`/tmp/test-certs.root/grid-security/certificates/79356fdd.namespaces' -> `/etc/grid-security/certificates/79356fdd.namespaces'
`/tmp/test-certs.root/grid-security/certificates/79356fdd.r0' -> `/etc/grid-security/certificates/79356fdd.r0'
`/tmp/test-certs.root/grid-security/certificates/79356fdd.signing_policy' -> `/etc/grid-security/certificates/79356fdd.signing_policy'
`/tmp/test-certs.root/grid-security/certificates/9a529ab0.0' -> `/etc/grid-security/certificates/9a529ab0.0'
`/tmp/test-certs.root/grid-security/certificates/9a529ab0.namespaces' -> `/etc/grid-security/certificates/9a529ab0.namespaces'
`/tmp/test-certs.root/grid-security/certificates/9a529ab0.r0' -> `/etc/grid-security/certificates/9a529ab0.r0'
`/tmp/test-certs.root/grid-security/certificates/9a529ab0.signing_policy' -> `/etc/grid-security/certificates/9a529ab0.signing_policy'
`/tmp/test-certs.root/grid-security/certificates/c1d9b6d3.0' -> `/etc/grid-security/certificates/c1d9b6d3.0'
`/tmp/test-certs.root/grid-security/certificates/c1d9b6d3.namespaces' -> `/etc/grid-security/certificates/c1d9b6d3.namespaces'
`/tmp/test-certs.root/grid-security/certificates/c1d9b6d3.r0' -> `/etc/grid-security/certificates/c1d9b6d3.r0'
`/tmp/test-certs.root/grid-security/certificates/c1d9b6d3.signing_policy' -> `/etc/grid-security/certificates/c1d9b6d3.signing_policy'
`/tmp/test-certs.root/grid-security/certificates/ffb9710f.0' -> `/etc/grid-security/certificates/ffb9710f.0'
`/tmp/test-certs.root/grid-security/certificates/ffb9710f.namespaces' -> `/etc/grid-security/certificates/ffb9710f.namespaces'
`/tmp/test-certs.root/grid-security/certificates/ffb9710f.r0' -> `/etc/grid-security/certificates/ffb9710f.r0'
`/tmp/test-certs.root/grid-security/certificates/ffb9710f.signing_policy' -> `/etc/grid-security/certificates/ffb9710f.signing_policy'
U org.glite.testsuites.ctb/CANL-C/tests/Makefile
U org.glite.testsuites.ctb/CANL-C/tests/canl-autonomous-test.sh
U org.glite.testsuites.ctb/CANL-C/tests/canl-common-testbeds.sh
U org.glite.testsuites.ctb/CANL-C/tests/canl-common.sh
U org.glite.testsuites.ctb/CANL-C/tests/canl-generate-fake-proxy.sh
U org.glite.testsuites.ctb/CANL-C/tests/canl-test-cert-handle.sh
U org.glite.testsuites.ctb/CANL-C/tests/canl-test-cs-openssl.sh
U org.glite.testsuites.ctb/CANL-C/tests/canl-test-sec-connection.sh
U org.glite.testsuites.ctb/CANL-C/tests/canl-test-sha2.sh
U org.glite.testsuites.ctb/CANL-C/tests/test-common.sh
========================
  REAL TESTS START HERE
========================
Nov 10 23:29:19 nympha19-2.zcu.cz canl-test-cert-handle.sh:    start
Testing if binary of canl_proxy_init is available   done
Testing if all binaries are available   done
Generating new proxy certificate    done
Simulating cert. delegation    done
Nov 10 23:29:19 nympha19-2.zcu.cz canl-test-cert-handle.sh:    end
Nov 10 23:29:19 nympha19-2.zcu.cz canl-test-cs-openssl.sh:    start
Testing if binaries of canl examples are available   done
Testing if all binaries are available   done
Testing credentials   done
Starting openssl server    done
CANL client: connecting to openssl server This is the testing message to send?   done
Starting canl sample server    done
Openssl client: connect to CANL sample server This is a testing message to send?   done
Nov 10 23:29:29 nympha19-2.zcu.cz canl-test-cs-openssl.sh:    end
Nov 10 23:29:29 nympha19-2.zcu.cz canl-test-sec-connection.sh:    start
Testing if binaries of canl examples are available   done
Testing if all binaries are available   done
Testing credentials   done
Testing server with nonexisting host certificates   done
Testing server with nonexisting host key   done
Testing server with nonexisting host cert and key   done
Testing client: connect to server not running   done
Testing client: use nonexisting proxy certificate   done
Starting canl sample server    done
CANL client: connect to CANL sample server server: waiting for connections... [SERVER] connection established with (null) [SERVER] Trying to send sth to the client [SERVER] message "This is a testing message to send" sent successfully [SERVER] received: This is the testing message to send [CLIENT] connection established [CLIENT] Trying to send sth to the server [CLIENT] message "This is the testing message to send" sent successfully [CLIENT] received: This is a testing message to send    done
Nov 10 23:29:29 nympha19-2.zcu.cz canl-test-sec-connection.sh:    end
==================
  TESTS END HERE
==================

Unit Tests

There are unit tests for caNl. They are integrated into the build process and any unit test failure causes the build to fail. However, he build infrastructure (ETICS) does not provide any way of collecting comprehensive unit test results. Thus, unit tests results are scattered over the build reports of individual components. See build reports for unit test output.

-- ZdenekSustr - 30-Apr-2012

Edit | Attach | Watch | Print version | History: r1 | Backlinks | Raw View | WYSIWYG | More topic actions
Topic revision: r1 - 2012-11-11 - ZdenekSustr
 
    • Cern Search Icon Cern Search
    • TWiki Search Icon TWiki Search
    • Google Search Icon Google Search

    EMI All webs login

This site is powered by the TWiki collaboration platform Powered by PerlCopyright &© 2008-2020 by the contributing authors. All material on this collaboration platform is the property of the contributing authors.
Ideas, requests, problems regarding TWiki? Send feedback